BDBM54995 2,4-dimethoxy-N-[(2-oxidanylidene-1,3-dihydrobenzimidazol-5-yl)carbamothioyl]benzamide::2,4-dimethoxy-N-[(2-oxo-1,3-dihydrobenzimidazol-5-yl)carbamothioyl]benzamide::2,4-dimethoxy-N-[[(2-oxo-1,3-dihydrobenzimidazol-5-yl)amino]-sulfanylidenemethyl]benzamide::MLS001141276::N-[(2-keto-1,3-dihydrobenzimidazol-5-yl)thiocarbamoyl]-2,4-dimethoxy-benzamide::SMR000651116::cid_1960924
SMILES: COc1ccc(C(=O)NC(=S)Nc2ccc3[nH]c(=O)[nH]c3c2)c(OC)c1
InChI Key: InChIKey=UUNLKOVJZRQVLO-UHFFFAOYSA-N
Data: 4 IC50
Activity Spreadsheet -- Enzyme Inhibition Constant Data from BindingDB
Found 4 hits for monomerid = 54995
Trg + Lig
Ki
nM
ΔG°
kcal/mole
IC50
nM
Kd
nM
EC50/IC50
nM
koff
s-1
kon
M-1s-1
pHTemp
°C
core protein
(Hepatitis C virus)
BDBM54995
(2,4-dimethoxy-N-[(2-oxidanylidene-1,3-dihydrobenzi...)
Show SMILES COc1ccc(C(=O)NC(=S)Nc2ccc3[nH]c(=O)[nH]c3c2)c(OC)c1
Show InChI InChI=1S/C17H16N4O4S/c1-24-10-4-5-11(14(8-10)25-2)15(22)21-17(26)18-9-3-6-12-13(7-9)20-16(23)19-12/h3-8H,1-2H3,(H2,19,20,23)(H2,18,21,22,26)
PCBioAssay
n/an/a>4.98E+4n/an/an/an/an/an/a
The Scripps Research Institute Molecular Screening Center
Curated by PubChem BioAssay
Assay Description
Source (MLPCN Center Name): The Scripps Research Institute Molecular Screening Center Affiliation: The Scripps Research Institute, TSRI Assay Provide...
PubChem Bioassay (2009)
BindingDB Entry DOI: 10.7270/Q29Z939R
HIV-1 B HXB2-LAI-IIIB-BRU
(Human immunodeficiency virus type 1 group M subtyp...)
BDBM54995
(2,4-dimethoxy-N-[(2-oxidanylidene-1,3-dihydrobenzi...)
Show SMILES COc1ccc(C(=O)NC(=S)Nc2ccc3[nH]c(=O)[nH]c3c2)c(OC)c1
Show InChI InChI=1S/C17H16N4O4S/c1-24-10-4-5-11(14(8-10)25-2)15(22)21-17(26)18-9-3-6-12-13(7-9)20-16(23)19-12/h3-8H,1-2H3,(H2,19,20,23)(H2,18,21,22,26)
PCBioAssay
n/an/a 6.85E+3n/an/an/an/an/an/a
The Scripps Research Institute Molecular Screening Center
Curated by PubChem BioAssay
PubChem Bioassay (2012)
BindingDB Entry DOI: 10.7270/Q29W0D3P
HIV-1 B HXB2-LAI-IIIB-BRU
(Human immunodeficiency virus type 1 group M subtyp...)
BDBM54995
(2,4-dimethoxy-N-[(2-oxidanylidene-1,3-dihydrobenzi...)
Show SMILES COc1ccc(C(=O)NC(=S)Nc2ccc3[nH]c(=O)[nH]c3c2)c(OC)c1
Show InChI InChI=1S/C17H16N4O4S/c1-24-10-4-5-11(14(8-10)25-2)15(22)21-17(26)18-9-3-6-12-13(7-9)20-16(23)19-12/h3-8H,1-2H3,(H2,19,20,23)(H2,18,21,22,26)
PCBioAssay
n/an/a 6.27E+3n/an/an/an/an/an/a
The Scripps Research Institute Molecular Screening Center
Curated by PubChem BioAssay
PubChem Bioassay (2012)
BindingDB Entry DOI: 10.7270/Q2FN14T0
HIV-1 B HXB2-LAI-IIIB-BRU
(Human immunodeficiency virus type 1 group M subtyp...)
BDBM54995
(2,4-dimethoxy-N-[(2-oxidanylidene-1,3-dihydrobenzi...)
Show SMILES COc1ccc(C(=O)NC(=S)Nc2ccc3[nH]c(=O)[nH]c3c2)c(OC)c1
Show InChI InChI=1S/C17H16N4O4S/c1-24-10-4-5-11(14(8-10)25-2)15(22)21-17(26)18-9-3-6-12-13(7-9)20-16(23)19-12/h3-8H,1-2H3,(H2,19,20,23)(H2,18,21,22,26)
PCBioAssay
n/an/a 1.63E+4n/an/an/an/an/an/a
The Scripps Research Institute Molecular Screening Center
Curated by PubChem BioAssay
PubChem Bioassay (2012)
BindingDB Entry DOI: 10.7270/Q2KD1WJB