BDBM551 N-{3-[(1S)-1-[(6S)-4-hydroxy-2-oxo-6-(2-phenylethyl)-6-propyl-5,6-dihydro-2H-pyran-3-yl]propyl]phenyl}-1-methyl-1H-imidazole-4-sulfonamide::Sulfonamide-Containing 5,6-Dihydro-4-hydroxy-2-pyrones::Tipranavir analog 8
SMILES: CCC[C@]1(CCc2ccccc2)CC(=O)C([C@@H](CC)c2cccc(NS(=O)(=O)c3cn(C)cn3)c2)C(=O)O1
InChI Key: InChIKey=XWOYUJQEURHLCR-IDWGMCNCSA-N
Data: 1 KI
Activity Spreadsheet -- Enzyme Inhibition Constant Data from BindingDB
Found 1 hit for monomerid = 551
Trg + Lig
Ki
nM
ΔG°
kcal/mole
IC50
nM
Kd
nM
EC50/IC50
nM
koff
s-1
kon
M-1s-1
pHTemp
°C
HIV-1 Protease
(Human immunodeficiency virus type 1)
BDBM551
(N-{3-[(1S)-1-[(6S)-4-hydroxy-2-oxo-6-(2-phenylethy...)
Show SMILES CCC[C@]1(CCc2ccccc2)CC(=O)C([C@@H](CC)c2cccc(NS(=O)(=O)c3cn(C)cn3)c2)C(=O)O1 |r|
Show InChI InChI=1S/C29H35N3O5S/c1-4-15-29(16-14-21-10-7-6-8-11-21)18-25(33)27(28(34)37-29)24(5-2)22-12-9-13-23(17-22)31-38(35,36)26-19-32(3)20-30-26/h6-13,17,19-20,24,27,31H,4-5,14-16,18H2,1-3H3/t24-,27?,29-/m0/s1
1 -12.1n/an/an/an/an/a5.022
Upjohn
Assay Description
HIV-1 protease was purified and refolded from E. coli inclusion bodies. The substrate used spans the p17-p24 processing site (R-V-S-Q-N-Y-P-I-V-Q-N-K...
J Med Chem 39: 4349-53 (1996)
Article DOI: 10.1021/jm960541s
BindingDB Entry DOI: 10.7270/Q2HQ3X35