BDBM55172 1-(2,3-dichlorophenyl)-3-(1,2,4-triazol-4-yl)urea::1-[2,3-bis(chloranyl)phenyl]-3-(1,2,4-triazol-4-yl)urea::MLS001232252::SMR000679373::cid_970018
SMILES: Clc1cccc(NC(=O)Nn2cnnc2)c1Cl
InChI Key: InChIKey=IERSTYASGPBJOH-UHFFFAOYSA-N
Data: 2 IC50
Activity Spreadsheet -- Enzyme Inhibition Constant Data from BindingDB
Found 2 hits for monomerid = 55172
Trg + Lig
Ki
nM
ΔG°
kcal/mole
IC50
nM
Kd
nM
EC50/IC50
nM
koff
s-1
kon
M-1s-1
pHTemp
°C
Procathepsin L
(Homo sapiens (Human))
BDBM55172
(1-(2,3-dichlorophenyl)-3-(1,2,4-triazol-4-yl)urea ...)
Show SMILES Clc1cccc(NC(=O)Nn2cnnc2)c1Cl
Show InChI InChI=1S/C9H7Cl2N5O/c10-6-2-1-3-7(8(6)11)14-9(17)15-16-4-12-13-5-16/h1-5H,(H2,14,15,17)
Reactome pathway
PCBioAssay
n/an/a>5.96E+4n/an/an/an/an/an/a
The Scripps Research Institute Molecular Screening Center
Curated by PubChem BioAssay
Assay Description
Source (MLPCN Center Name): The Scripps Research Institute Molecular Screening Center Affiliation: The Scripps Research Institute, TSRI Assay Provide...
PubChem Bioassay (2009)
BindingDB Entry DOI: 10.7270/Q20K2704
M18 aspartyl aminopeptidase
(Plasmodium falciparum 3D7)
BDBM55172
(1-(2,3-dichlorophenyl)-3-(1,2,4-triazol-4-yl)urea ...)
Show SMILES Clc1cccc(NC(=O)Nn2cnnc2)c1Cl
Show InChI InChI=1S/C9H7Cl2N5O/c10-6-2-1-3-7(8(6)11)14-9(17)15-16-4-12-13-5-16/h1-5H,(H2,14,15,17)
PCBioAssay
n/an/a 631n/an/an/an/an/an/a
The Scripps Research Institute Molecular Screening Center
Curated by PubChem BioAssay
Assay Description
Source (MLPCN Center Name): The Scripps Research Institute Molecular Screening Center Affiliation: The Scripps Research Institute, TSRI Assay Provide...
PubChem Bioassay (2009)
BindingDB Entry DOI: 10.7270/Q24B2ZQ2