BDBM5537 6-(cyclohexylmethoxy)-N-(3-methoxyphenyl)-9H-purin-2-amine::6-Cyclohexylmethoxy-2-(3 -methoxyanilino)purine::O6-Cyclohexylmethylguanine deriv. 21
SMILES: COc1cccc(Nc2nc(OCC3CCCCC3)c3[nH]cnc3n2)c1
InChI Key: InChIKey=TZIVMMCILGEHRH-UHFFFAOYSA-N
Data: 2 IC50
PDB links: 3 PDB IDs contain inhibitors having a similarity of 90% to this monomer.
Activity Spreadsheet -- Enzyme Inhibition Constant Data from BindingDB
Found 2 hits for monomerid = 5537
Trg + Lig
Ki
nM
ΔG°
kcal/mole
IC50
nM
Kd
nM
EC50/IC50
nM
koff
s-1
kon
M-1s-1
pHTemp
°C
Cyclin-Dependent Kinase 2 (CDK2)
(Homo sapiens (Human))
BDBM5537
(6-(cyclohexylmethoxy)-N-(3-methoxyphenyl)-9H-purin...)
Show SMILES COc1cccc(Nc2nc(OCC3CCCCC3)c3[nH]cnc3n2)c1
Show InChI InChI=1S/C19H23N5O2/c1-25-15-9-5-8-14(10-15)22-19-23-17-16(20-12-21-17)18(24-19)26-11-13-6-3-2-4-7-13/h5,8-10,12-13H,2-4,6-7,11H2,1H3,(H2,20,21,22,23,24)
NCI pathway
Reactome pathway
n/an/a 1.80E+3n/an/an/an/an/an/a
University of Newcastle
Assay Description
The enzyme was assayed with substrate histone H1 in the presence of 12.5 uM ATP/[gamma-32P] ATP. IC50 is the inhibitor concentration, which inhibits ...
J Med Chem 47: 3710-22 (2004)
Article DOI: 10.1021/jm0311442
BindingDB Entry DOI: 10.7270/Q24J0C9Z
3D
3D Structure (docked)
Cyclin-Dependent Kinase 1 (CDK1)
(Marthasterias glacialis (starfish))
BDBM5537
(6-(cyclohexylmethoxy)-N-(3-methoxyphenyl)-9H-purin...)
Show SMILES COc1cccc(Nc2nc(OCC3CCCCC3)c3[nH]cnc3n2)c1
Show InChI InChI=1S/C19H23N5O2/c1-25-15-9-5-8-14(10-15)22-19-23-17-16(20-12-21-17)18(24-19)26-11-13-6-3-2-4-7-13/h5,8-10,12-13H,2-4,6-7,11H2,1H3,(H2,20,21,22,23,24)
n/an/a 2.20E+3n/an/an/an/an/an/a
University of Newcastle
Assay Description
The enzyme was assayed with substrate histone H1 in the presence of 12.5 uM ATP/[gamma-32P] ATP. IC50 is the inhibitor concentration, which inhibits ...
J Med Chem 47: 3710-22 (2004)
Article DOI: 10.1021/jm0311442
BindingDB Entry DOI: 10.7270/Q24J0C9Z