BDBM554 5-cyano-N-{3-[(1R)-1-[(6R)-4-hydroxy-2-oxo-6-(2-phenylethyl)-6-propyl-5,6-dihydro-2H-pyran-3-yl]propyl]phenyl}pyridine-2-sulfonamide::Sulfonamide-Containing 5,6-Dihydro-4-hydroxy-2-pyrones::Tipranavir analog 11
SMILES: CCC[C@@]1(CCc2ccccc2)CC(=O)C([C@H](CC)c2cccc(NS(=O)(=O)c3ccc(cn3)C#N)c2)C(=O)O1
InChI Key: InChIKey=CNXLIJOZVTZRJJ-AOJKPLOISA-N
Data: 1 KI
PDB links: 5 PDB IDs contain inhibitors having a similarity of 90% to this monomer.
Activity Spreadsheet -- Enzyme Inhibition Constant Data from BindingDB
Found 1 hit for monomerid = 554
Trg + Lig
Ki
nM
ΔG°
kcal/mole
IC50
nM
Kd
nM
EC50/IC50
nM
koff
s-1
kon
M-1s-1
pHTemp
°C
HIV-1 Protease
(Human immunodeficiency virus type 1)
BDBM554
(5-cyano-N-{3-[(1R)-1-[(6R)-4-hydroxy-2-oxo-6-(2-ph...)
Show SMILES CCC[C@@]1(CCc2ccccc2)CC(=O)C([C@H](CC)c2cccc(NS(=O)(=O)c3ccc(cn3)C#N)c2)C(=O)O1 |r|
Show InChI InChI=1S/C31H33N3O5S/c1-3-16-31(17-15-22-9-6-5-7-10-22)19-27(35)29(30(36)39-31)26(4-2)24-11-8-12-25(18-24)34-40(37,38)28-14-13-23(20-32)21-33-28/h5-14,18,21,26,29,34H,3-4,15-17,19H2,1-2H3/t26-,29?,31-/m1/s1
0.00700 -15.1n/an/an/an/an/a5.022
Upjohn
Assay Description
HIV-1 protease was purified and refolded from E. coli inclusion bodies. The substrate used spans the p17-p24 processing site (R-V-S-Q-N-Y-P-I-V-Q-N-K...
J Med Chem 39: 4349-53 (1996)
Article DOI: 10.1021/jm960541s
BindingDB Entry DOI: 10.7270/Q2HQ3X35