BDBM5592 2-arylamino-pyrimidine deriv. 9b::6-(cyclohexylmethoxy)-2-N-(4-methoxyphenyl)-5-nitrosopyrimidine-2,4-diamine
SMILES: COc1ccc(Nc2nc(N)c(N=O)c(OCC3CCCCC3)n2)cc1
InChI Key: InChIKey=WWJLGEMPECUYJI-UHFFFAOYSA-N
Data: 2 IC50
Activity Spreadsheet -- Enzyme Inhibition Constant Data from BindingDB
Found 2 hits for monomerid = 5592
Trg + Lig
Ki
nM
ΔG°
kcal/mole
IC50
nM
Kd
nM
EC50/IC50
nM
koff
s-1
kon
M-1s-1
pHTemp
°C
Cyclin-Dependent Kinase 2 (CDK2)
(Homo sapiens (Human))
BDBM5592
(2-arylamino-pyrimidine deriv. 9b | 6-(cyclohexylme...)
Show SMILES COc1ccc(Nc2nc(N)c(N=O)c(OCC3CCCCC3)n2)cc1
Show InChI InChI=1S/C18H23N5O3/c1-25-14-9-7-13(8-10-14)20-18-21-16(19)15(23-24)17(22-18)26-11-12-5-3-2-4-6-12/h7-10,12H,2-6,11H2,1H3,(H3,19,20,21,22)
NCI pathway
Reactome pathway
n/an/a 220n/an/an/an/a7.530
University of Newcastle
Assay Description
The enzyme was assayed with substrate histone H1 in the presence of 12.5 uM ATP/[gamma-32P] ATP. IC50 is the inhibitor concentration, which inhibits ...
Bioorg Med Chem Lett 13: 3079-82 (2003)
Article DOI: 10.1016/s0960-894x(03)00651-6
BindingDB Entry DOI: 10.7270/Q2R78CDT
3D
3D Structure (docked)
Cyclin-Dependent Kinase 1 (CDK1)
(Marthasterias glacialis (starfish))
BDBM5592
(2-arylamino-pyrimidine deriv. 9b | 6-(cyclohexylme...)
Show SMILES COc1ccc(Nc2nc(N)c(N=O)c(OCC3CCCCC3)n2)cc1
Show InChI InChI=1S/C18H23N5O3/c1-25-14-9-7-13(8-10-14)20-18-21-16(19)15(23-24)17(22-18)26-11-12-5-3-2-4-6-12/h7-10,12H,2-6,11H2,1H3,(H3,19,20,21,22)
n/an/a 230n/an/an/an/a7.530
University of Newcastle
Assay Description
The enzyme was assayed with substrate histone H1 in the presence of 12.5 uM ATP/[gamma-32P] ATP. IC50 is the inhibitor concentration, which inhibits ...
Bioorg Med Chem Lett 13: 3079-82 (2003)
Article DOI: 10.1016/s0960-894x(03)00651-6
BindingDB Entry DOI: 10.7270/Q2R78CDT