BDBM56565 (cyclopentylideneamino) N-(4-methylphenyl)carbamate::MLS000569139::N-(4-methylphenyl)carbamic acid (cyclopentylideneamino) ester::N-(p-tolyl)carbamic acid (cyclopentylideneamino) ester::SMR000174596::cid_819097
SMILES: [#6]-c1ccc(-[#7]-[#6](=O)-[#8]\[#7]=[#6]-2\[#6]-[#6]-[#6]-[#6]-2)cc1
InChI Key: InChIKey=HVOYKTIJNJWOGS-UHFFFAOYSA-N
Data: 1 IC50  2 EC50
Activity Spreadsheet -- Enzyme Inhibition Constant Data from BindingDB
Found 3 hits for monomerid = 56565
Trg + Lig
Ki
nM
ΔG°
kcal/mole
IC50
nM
Kd
nM
EC50/IC50
nM
koff
s-1
kon
M-1s-1
pHTemp
°C
Kallikrein-5
(Homo sapiens (Human))
BDBM56565
((cyclopentylideneamino) N-(4-methylphenyl)carbamat...)
Show SMILES [#6]-c1ccc(-[#7]-[#6](=O)-[#8]\[#7]=[#6]-2\[#6]-[#6]-[#6]-[#6]-2)cc1
Show InChI InChI=1S/C13H16N2O2/c1-10-6-8-11(9-7-10)14-13(16)17-15-12-4-2-3-5-12/h6-9H,2-5H2,1H3,(H,14,16)
PCBioAssay
n/an/a 5.00E+4n/an/an/an/an/an/a
PCMD
Curated by PubChem BioAssay
Assay Description
Molecular Library Screening Center Network (MLSCN) Penn Center for Molecular Discovery (PCMD) Assay Provider: Scott L. Diamond, University of Pennsy...
PubChem Bioassay (2008)
BindingDB Entry DOI: 10.7270/Q2GH9GC8
Vacuolar aminopeptidase 1
(Saccharomyces cerevisiae)
BDBM56565
((cyclopentylideneamino) N-(4-methylphenyl)carbamat...)
Show SMILES [#6]-c1ccc(-[#7]-[#6](=O)-[#8]\[#7]=[#6]-2\[#6]-[#6]-[#6]-[#6]-2)cc1
Show InChI InChI=1S/C13H16N2O2/c1-10-6-8-11(9-7-10)14-13(16)17-15-12-4-2-3-5-12/h6-9H,2-5H2,1H3,(H,14,16)
PCBioAssay
n/an/an/an/a>3.30E+4n/an/an/an/a
NMMLSC
Curated by PubChem BioAssay
Assay Description
University of New Mexico Assay Overview: Assay Support: 1R03 MH086450-01 Project Title: Chemical Screen of TOR pathway GFP fusion proteins in S. ...
PubChem Bioassay (2010)
BindingDB Entry DOI: 10.7270/Q21R6P02
Citrate synthase, peroxisomal [1-24]
(Saccharomyces cerevisiae)
BDBM56565
((cyclopentylideneamino) N-(4-methylphenyl)carbamat...)
Show SMILES [#6]-c1ccc(-[#7]-[#6](=O)-[#8]\[#7]=[#6]-2\[#6]-[#6]-[#6]-[#6]-2)cc1
Show InChI InChI=1S/C13H16N2O2/c1-10-6-8-11(9-7-10)14-13(16)17-15-12-4-2-3-5-12/h6-9H,2-5H2,1H3,(H,14,16)
PCBioAssay
n/an/an/an/a 3.80E+3n/an/an/an/a
NMMLSC
Curated by PubChem BioAssay
Assay Description
University of New Mexico Assay Overview: Assay Support: 1R03 MH086450-01 Project Title: Chemical Screen of TOR pathway GFP fusion proteins in S. ...
PubChem Bioassay (2010)
BindingDB Entry DOI: 10.7270/Q25H7DRT