null
SMILES: CC(C)(C)c1cnc(CSc2cnc(Nc3cccnc3)s2)o1
InChI Key: InChIKey=MPJITOINOMJIJI-UHFFFAOYSA-N
Activity Spreadsheet -- Enzyme Inhibition Constant Data from BindingDB
Found 3 hits for monomerid = 5724
Trg + Lig
Ki
nM
ΔG°
kcal/mole
IC50
nM
Kd
nM
EC50/IC50
nM
koff
s-1
kon
M-1s-1
pHTemp
°C
Cyclin-dependent kinase/G2/mitotic-specific cyclin- 1
(Homo sapiens (Human))
BDBM5724
(2-aminothiazole 8 | 5-{[(5-tert-butyl-1,3-oxazol-2...)
Show SMILES CC(C)(C)c1cnc(CSc2cnc(Nc3cccnc3)s2)o1
Show InChI InChI=1S/C16H18N4OS2/c1-16(2,3)12-8-18-13(21-12)10-22-14-9-19-15(23-14)20-11-5-4-6-17-7-11/h4-9H,10H2,1-3H3,(H,19,20)
Reactome pathway
n/an/a 10n/an/an/an/an/an/a
Bristol-Myers Squibb Company
Assay Description
The enzyme was assayed with substrate in the presence of 25 uM ATP/[gamma-33P] ATP and test compound. Dose response curves were generated to determ...
Bioorg Med Chem Lett 14: 2973-7 (2004)
Article DOI: 10.1016/j.bmcl.2004.02.105
BindingDB Entry DOI: 10.7270/Q27942WW
Cyclin-dependent kinase 4/G1/S-specific cyclin-D1
(Homo sapiens (Human))
BDBM5724
(2-aminothiazole 8 | 5-{[(5-tert-butyl-1,3-oxazol-2...)
Show SMILES CC(C)(C)c1cnc(CSc2cnc(Nc3cccnc3)s2)o1
Show InChI InChI=1S/C16H18N4OS2/c1-16(2,3)12-8-18-13(21-12)10-22-14-9-19-15(23-14)20-11-5-4-6-17-7-11/h4-9H,10H2,1-3H3,(H,19,20)
NCI pathway
Reactome pathway
n/an/a 130n/an/an/an/an/an/a
Bristol-Myers Squibb Company
Assay Description
The enzyme was assayed with substrate in the presence of 25 uM ATP/[gamma-33P] ATP and test compound. Dose response curves were generated to determ...
Bioorg Med Chem Lett 14: 2973-7 (2004)
Article DOI: 10.1016/j.bmcl.2004.02.105
BindingDB Entry DOI: 10.7270/Q27942WW
Cyclin-dependent kinase 2/G1/S-specific cyclin-E1
(Homo sapiens (Human))
BDBM5724
(2-aminothiazole 8 | 5-{[(5-tert-butyl-1,3-oxazol-2...)
Show SMILES CC(C)(C)c1cnc(CSc2cnc(Nc3cccnc3)s2)o1
Show InChI InChI=1S/C16H18N4OS2/c1-16(2,3)12-8-18-13(21-12)10-22-14-9-19-15(23-14)20-11-5-4-6-17-7-11/h4-9H,10H2,1-3H3,(H,19,20)
n/an/a 3n/an/an/an/a8.030
Bristol-Myers Squibb Company
Assay Description
The enzyme was assayed with substrate in the presence of 25 uM ATP/[gamma-33P] ATP and test compound. Dose response curves were generated to determ...
Bioorg Med Chem Lett 14: 2973-7 (2004)
Article DOI: 10.1016/j.bmcl.2004.02.105
BindingDB Entry DOI: 10.7270/Q27942WW