null
SMILES: [O-][N+](=O)c1ccc(o1)C(=O)[C-](C#N)c1[nH]c2ccccc2[nH+]1
InChI Key: InChIKey=CANDBIRXGZDIAX-UHFFFAOYSA-O
Activity Spreadsheet -- Enzyme Inhibition Constant Data from BindingDB
Found 3 hits for monomerid = 57749
Trg + Lig
Ki
nM
ΔG°
kcal/mole
IC50
nM
Kd
nM
EC50/IC50
nM
koff
s-1
kon
M-1s-1
pHTemp
°C
Streptokinase A
(Streptococcus pyogenes M1 GAS)
BDBM57749
(2-(1,3-dihydrobenzimidazol-2-ylidene)-3-(5-nitro-2...)
Show SMILES [O-][N+](=O)c1ccc(o1)C(=O)[C-](C#N)c1[nH]c2ccccc2[nH+]1
Show InChI InChI=1S/C14H7N4O4/c15-7-8(13(19)11-5-6-12(22-11)18(20)21)14-16-9-3-1-2-4-10(9)17-14/h1-6H,(H,16,17)/q-1/p+1
PCBioAssay
n/an/an/an/a 2.76E+4n/an/an/an/a
Broad Institute
Curated by PubChem BioAssay
Assay Description
Keywords: Group A streptococcus, GAS, streptokinase, expression, virulence, inhibition, dose response, EC50 Assay Overview: The goal of this assa...
PubChem Bioassay (2009)
BindingDB Entry DOI: 10.7270/Q2736PBV
Endoribonuclease toxin MazF
(Escherichia coli str. K-12 substr. MG1655)
BDBM57749
(2-(1,3-dihydrobenzimidazol-2-ylidene)-3-(5-nitro-2...)
Show SMILES [O-][N+](=O)c1ccc(o1)C(=O)[C-](C#N)c1[nH]c2ccccc2[nH+]1
Show InChI InChI=1S/C14H7N4O4/c15-7-8(13(19)11-5-6-12(22-11)18(20)21)14-16-9-3-1-2-4-10(9)17-14/h1-6H,(H,16,17)/q-1/p+1
PCBioAssay
n/an/an/an/a>9.90E+4n/an/an/an/a
Burnham Center for Chemical Genomics
Curated by PubChem BioAssay
Assay Description
Data Source: Sanford-Burnham Center for Chemical Genomics (SBCCG) Source Affiliation: Sanford-Burnham Medical Research Institute (SBMRI, San Diego, C...
PubChem Bioassay (2011)
BindingDB Entry DOI: 10.7270/Q2Z31X54
Endoribonuclease toxin MazF
(Escherichia coli str. K-12 substr. MG1655)
BDBM57749
(2-(1,3-dihydrobenzimidazol-2-ylidene)-3-(5-nitro-2...)
Show SMILES [O-][N+](=O)c1ccc(o1)C(=O)[C-](C#N)c1[nH]c2ccccc2[nH+]1
Show InChI InChI=1S/C14H7N4O4/c15-7-8(13(19)11-5-6-12(22-11)18(20)21)14-16-9-3-1-2-4-10(9)17-14/h1-6H,(H,16,17)/q-1/p+1
PCBioAssay
n/an/an/an/a 5.53E+3n/an/an/an/a
Burnham Center for Chemical Genomics
Curated by PubChem BioAssay
Assay Description
Data Source: Sanford-Burnham Center for Chemical Genomics (SBCCG) Source Affiliation: Sanford-Burnham Medical Research Institute (SBMRI, San Diego, C...
PubChem Bioassay (2011)
BindingDB Entry DOI: 10.7270/Q2TB15DB