null
SMILES: [O-][N+](=O)c1ccc(\C=N\NC(=O)Cc2ccc(cc2)[N+]([O-])=O)o1
InChI Key: InChIKey=ZHQFDFNOWCGLLO-RIYZIHGNSA-N
Activity Spreadsheet -- Enzyme Inhibition Constant Data from BindingDB
Found 2 hits for monomerid = 57939
Trg + Lig
Ki
nM
ΔG°
kcal/mole
IC50
nM
Kd
nM
EC50/IC50
nM
koff
s-1
kon
M-1s-1
pHTemp
°C
RecBCD enzyme subunit RecD
(Escherichia coli str. K-12 substr. MG1655)
BDBM57939
(MLS000703514 | N-[(5-nitro-2-furanyl)methylideneam...)
Show SMILES [O-][N+](=O)c1ccc(\C=N\NC(=O)Cc2ccc(cc2)[N+]([O-])=O)o1
Show InChI InChI=1S/C13H10N4O6/c18-12(7-9-1-3-10(4-2-9)16(19)20)15-14-8-11-5-6-13(23-11)17(21)22/h1-6,8H,7H2,(H,15,18)/b14-8+
PCBioAssay
n/an/a>3.95E+4n/an/an/an/an/an/a
The Scripps Research Institute Molecular Screening Center
Curated by PubChem BioAssay
Assay Description
Source (MLPCN Center Name): The Scripps Research Institute Molecular Screening Center (SRIMSC) Affiliation: The Scripps Research Institute, TSRI Assa...
PubChem Bioassay (2010)
BindingDB Entry DOI: 10.7270/Q2TB15CW
Streptokinase A
(Streptococcus pyogenes M1 GAS)
BDBM57939
(MLS000703514 | N-[(5-nitro-2-furanyl)methylideneam...)
Show SMILES [O-][N+](=O)c1ccc(\C=N\NC(=O)Cc2ccc(cc2)[N+]([O-])=O)o1
Show InChI InChI=1S/C13H10N4O6/c18-12(7-9-1-3-10(4-2-9)16(19)20)15-14-8-11-5-6-13(23-11)17(21)22/h1-6,8H,7H2,(H,15,18)/b14-8+
PCBioAssay
n/an/an/an/a 3.70E+4n/an/an/an/a
Broad Institute
Curated by PubChem BioAssay
Assay Description
Keywords: Group A streptococcus, GAS, streptokinase, expression, virulence, inhibition, dose response, EC50 Assay Overview: The goal of this assa...
PubChem Bioassay (2009)
BindingDB Entry DOI: 10.7270/Q2736PBV