BDBM58080 2-Pyridin-4-yl-4-m-tolyloxy-quinazoline::4-(3-methylphenoxy)-2-(4-pyridyl)quinazoline::4-(3-methylphenoxy)-2-pyridin-4-yl-quinazoline::4-(3-methylphenoxy)-2-pyridin-4-ylquinazoline::MLS000769517::SMR000434268::cid_930335
SMILES: Cc1cccc(Oc2nc(nc3ccccc23)-c2ccncc2)c1
InChI Key: InChIKey=MKRCEEXQXFSFKQ-UHFFFAOYSA-N
Data: 1 EC50
Activity Spreadsheet -- Enzyme Inhibition Constant Data from BindingDB
Found 1 hit for monomerid = 58080
Trg + Lig
Ki
nM
ΔG°
kcal/mole
IC50
nM
Kd
nM
EC50/IC50
nM
koff
s-1
kon
M-1s-1
pHTemp
°C
streptokinase A precursor
(Streptococcus pyogenes M1 GAS)
BDBM58080
(2-Pyridin-4-yl-4-m-tolyloxy-quinazoline | 4-(3-met...)
Show SMILES Cc1cccc(Oc2nc(nc3ccccc23)-c2ccncc2)c1
Show InChI InChI=1S/C20H15N3O/c1-14-5-4-6-16(13-14)24-20-17-7-2-3-8-18(17)22-19(23-20)15-9-11-21-12-10-15/h2-13H,1H3
PCBioAssay
n/an/an/an/a 1.50E+5n/an/an/an/a
Broad Institute
Curated by PubChem BioAssay
Assay Description
Keywords: Group A streptococcus, GAS, streptokinase, expression, virulence, inhibition, dose response, EC50 Assay Overview: The goal of this assa...
PubChem Bioassay (2009)
BindingDB Entry DOI: 10.7270/Q2736PBV