BDBM58242 3-(4-methoxyphenyl)-5-phenyl-2-(trifluoromethyl)-1H-pyrazolo[1,5-a]pyrimidin-7-one::3-(4-methoxyphenyl)-5-phenyl-2-(trifluoromethyl)pyrazolo[1,5-a]pyrimidin-7(4H)-one::CHEMBL522297::MLS000850070::SMR000456088::cid_2810122
SMILES: COc1ccc(cc1)-c1c([nH]n2c1nc(cc2=O)-c1ccccc1)C(F)(F)F
InChI Key: InChIKey=UVPIEFKZXQPGBJ-UHFFFAOYSA-N
Data: 2 IC50  2 EC50
Activity Spreadsheet -- Enzyme Inhibition Constant Data from BindingDB
Found 4 hits for monomerid = 58242
Trg + Lig
Ki
nM
ΔG°
kcal/mole
IC50
nM
Kd
nM
EC50/IC50
nM
koff
s-1
kon
M-1s-1
pHTemp
°C
streptokinase A precursor
(Streptococcus pyogenes M1 GAS)
BDBM58242
(3-(4-methoxyphenyl)-5-phenyl-2-(trifluoromethyl)-1...)
Show SMILES COc1ccc(cc1)-c1c([nH]n2c1nc(cc2=O)-c1ccccc1)C(F)(F)F
Show InChI InChI=1S/C20H14F3N3O2/c1-28-14-9-7-13(8-10-14)17-18(20(21,22)23)25-26-16(27)11-15(24-19(17)26)12-5-3-2-4-6-12/h2-11,25H,1H3
PCBioAssay
n/an/an/an/a 1.50E+5n/an/an/an/a
Broad Institute
Curated by PubChem BioAssay
Assay Description
Keywords: Group A streptococcus, GAS, streptokinase, expression, virulence, inhibition, dose response, EC50 Assay Overview: The goal of this assa...
PubChem Bioassay (2009)
BindingDB Entry DOI: 10.7270/Q2736PBV
1-deoxy-D-xylulose-5-phosphate synthase
(Mycobacterium tuberculosis)
BDBM58242
(3-(4-methoxyphenyl)-5-phenyl-2-(trifluoromethyl)-1...)
Show SMILES COc1ccc(cc1)-c1c([nH]n2c1nc(cc2=O)-c1ccccc1)C(F)(F)F
Show InChI InChI=1S/C20H14F3N3O2/c1-28-14-9-7-13(8-10-14)17-18(20(21,22)23)25-26-16(27)11-15(24-19(17)26)12-5-3-2-4-6-12/h2-11,25H,1H3
n/an/a 2.02E+4n/an/an/an/an/an/a
University of Illinois at Chicago
Curated by ChEMBL
Assay Description
Inhibition of Mycobacterium tuberculosis cloned 1-deoxy-D-xylulose-5-phosphate synthase expressed in Escherichia coli
Bioorg Med Chem Lett 18: 5320-3 (2008)
Article DOI: 10.1016/j.bmcl.2008.08.034
BindingDB Entry DOI: 10.7270/Q2TX3F71
corticotropin releasing factor-binding protein
(Homo sapiens (Human))
BDBM58242
(3-(4-methoxyphenyl)-5-phenyl-2-(trifluoromethyl)-1...)
Show SMILES COc1ccc(cc1)-c1c([nH]n2c1nc(cc2=O)-c1ccccc1)C(F)(F)F
Show InChI InChI=1S/C20H14F3N3O2/c1-28-14-9-7-13(8-10-14)17-18(20(21,22)23)25-26-16(27)11-15(24-19(17)26)12-5-3-2-4-6-12/h2-11,25H,1H3
PCBioAssay
n/an/a 1.57E+4n/an/an/an/an/an/a
Burnham Center for Chemical Genomics
Curated by PubChem BioAssay
PubChem Bioassay (2012)
BindingDB Entry DOI: 10.7270/Q2NC5ZS3
corticotropin releasing factor-binding protein
(Homo sapiens (Human))
BDBM58242
(3-(4-methoxyphenyl)-5-phenyl-2-(trifluoromethyl)-1...)
Show SMILES COc1ccc(cc1)-c1c([nH]n2c1nc(cc2=O)-c1ccccc1)C(F)(F)F
Show InChI InChI=1S/C20H14F3N3O2/c1-28-14-9-7-13(8-10-14)17-18(20(21,22)23)25-26-16(27)11-15(24-19(17)26)12-5-3-2-4-6-12/h2-11,25H,1H3
PCBioAssay
n/an/an/an/a>5.30E+4n/an/an/an/a
Burnham Center for Chemical Genomics
Curated by PubChem BioAssay
Assay Description
Data Source: Sanford-Burnham Center for Chemical Genomics (SBCCG) Source Affiliation: Sanford-Burnham Medical Research Institute (SBMRI, San Diego, C...
PubChem Bioassay (2012)
BindingDB Entry DOI: 10.7270/Q2VX0F3D