BDBM5844 3-{4-[(2-{[4-(methanesulfonylmethyl)phenyl]amino}pyrimidin-4-yl)(methyl)amino]phenyl}-1-{4-[(4-methylpiperazin-1-yl)methyl]phenyl}urea::urea deriv. 35
SMILES: CN(c1ccc(NC(=O)Nc2ccc(CN3CCN(C)CC3)cc2)cc1)c1ccnc(Nc2ccc(CS(C)(=O)=O)cc2)n1
InChI Key: InChIKey=WUUXQSKAAWHECK-UHFFFAOYSA-N
Data: 1 IC50
Activity Spreadsheet -- Enzyme Inhibition Constant Data from BindingDB
Found 1 hit for monomerid = 5844
Trg + Lig
Ki
nM
ΔG°
kcal/mole
IC50
nM
Kd
nM
EC50/IC50
nM
koff
s-1
kon
M-1s-1
pHTemp
°C
Vascular endothelial growth factor receptor 2
(Homo sapiens (Human))
BDBM5844
(3-{4-[(2-{[4-(methanesulfonylmethyl)phenyl]amino}p...)
Show SMILES CN(c1ccc(NC(=O)Nc2ccc(CN3CCN(C)CC3)cc2)cc1)c1ccnc(Nc2ccc(CS(C)(=O)=O)cc2)n1
Show InChI InChI=1S/C32H38N8O3S/c1-38-18-20-40(21-19-38)22-24-4-8-27(9-5-24)35-32(41)36-28-12-14-29(15-13-28)39(2)30-16-17-33-31(37-30)34-26-10-6-25(7-11-26)23-44(3,42)43/h4-17H,18-23H2,1-3H3,(H,33,34,37)(H2,35,36,41)
NCI pathway
Reactome pathway
n/an/a 4n/an/an/an/a7.522
GlaxoSmithKline
Assay Description
The assay was using baculovirus-expressed recombinant protein kinase purified as the intracellular domain fused by GST tag, interacting with biotinyl...
Bioorg Med Chem Lett 15: 3519-23 (2005)
Article DOI: 10.1016/j.bmcl.2005.05.096
BindingDB Entry DOI: 10.7270/Q2KK990W