BDBM59113 Hymenialdisine, 27g
SMILES: NC1=NC(=O)C(N1)=C1CCNC(=O)c2[nH]c3c(cccc3c12)N(=O)=O
InChI Key: InChIKey=ISYFANQBAGVSNZ-UHFFFAOYSA-N
Data: 3 IC50
Activity Spreadsheet -- Enzyme Inhibition Constant Data from BindingDB
Found 3 hits for monomerid = 59113
Trg + Lig
Ki
nM
ΔG°
kcal/mole
IC50
nM
Kd
nM
EC50/IC50
nM
koff
s-1
kon
M-1s-1
pHTemp
°C
Cyclin-dependent kinase 5 regulatory subunit 1
(Homo sapiens (Human))
BDBM59113
(Hymenialdisine, 27g)
Show SMILES NC1=NC(=O)C(N1)=C1CCNC(=O)c2[nH]c3c(cccc3c12)N(=O)=O |w:7.8,t:1|
Show InChI InChI=1S/C15H12N6O4/c16-15-19-11(14(23)20-15)7-4-5-17-13(22)12-9(7)6-2-1-3-8(21(24)25)10(6)18-12/h1-3,18H,4-5H2,(H,17,22)(H3,16,19,20,23)
NCI pathway
Reactome pathway
n/an/a 109n/an/an/an/a7.2n/a
Genomics Institute of the Novartis Research Foundation
Assay Description
In vitro kinase assay using SPA assay kit from Amersham Pharmacia Biotech, Uk.
Chem Biol 11: 247-59 (2004)
Article DOI: 10.1016/j.chembiol.2004.01.015
BindingDB Entry DOI: 10.7270/Q2FN14M9
Glycogen synthase kinase-3 beta
(Homo sapiens (Human))
BDBM59113
(Hymenialdisine, 27g)
Show SMILES NC1=NC(=O)C(N1)=C1CCNC(=O)c2[nH]c3c(cccc3c12)N(=O)=O |w:7.8,t:1|
Show InChI InChI=1S/C15H12N6O4/c16-15-19-11(14(23)20-15)7-4-5-17-13(22)12-9(7)6-2-1-3-8(21(24)25)10(6)18-12/h1-3,18H,4-5H2,(H,17,22)(H3,16,19,20,23)
NCI pathway
Reactome pathway
n/an/a 48n/an/an/an/a7.2n/a
Genomics Institute of the Novartis Research Foundation
Assay Description
In vitro kinase assay using SPA assay kit from Amersham Pharmacia Biotech, Uk.
Chem Biol 11: 247-59 (2004)
Article DOI: 10.1016/j.chembiol.2004.01.015
BindingDB Entry DOI: 10.7270/Q2FN14M9
Cyclin-dependent kinase 1
(Homo sapiens (Human))
BDBM59113
(Hymenialdisine, 27g)
Show SMILES NC1=NC(=O)C(N1)=C1CCNC(=O)c2[nH]c3c(cccc3c12)N(=O)=O |w:7.8,t:1|
Show InChI InChI=1S/C15H12N6O4/c16-15-19-11(14(23)20-15)7-4-5-17-13(22)12-9(7)6-2-1-3-8(21(24)25)10(6)18-12/h1-3,18H,4-5H2,(H,17,22)(H3,16,19,20,23)
Reactome pathway
n/an/a 1.20E+3n/an/an/an/a7.2n/a
Genomics Institute of the Novartis Research Foundation
Assay Description
In vitro kinase assay using SPA assay kit from Amersham Pharmacia Biotech, Uk.
Chem Biol 11: 247-59 (2004)
Article DOI: 10.1016/j.chembiol.2004.01.015
BindingDB Entry DOI: 10.7270/Q2FN14M9