BDBM59114 Hymenialdisine, 27i
SMILES: NC1=NC(=O)C(N1)=C1CCNC(=O)c2[nH]c3c(N)cccc3c12
InChI Key: InChIKey=WFCKUPLLUJUYHP-UHFFFAOYSA-N
Data: 3 IC50
Activity Spreadsheet -- Enzyme Inhibition Constant Data from BindingDB
Found 3 hits for monomerid = 59114
Trg + Lig
Ki
nM
ΔG°
kcal/mole
IC50
nM
Kd
nM
EC50/IC50
nM
koff
s-1
kon
M-1s-1
pHTemp
°C
Cyclin-dependent kinase 5 regulatory subunit 1
(Homo sapiens (Human))
BDBM59114
(Hymenialdisine, 27i)
Show SMILES NC1=NC(=O)C(N1)=C1CCNC(=O)c2[nH]c3c(N)cccc3c12 |w:7.8,t:1|
Show InChI InChI=1S/C15H14N6O2/c16-8-3-1-2-6-9-7(11-14(23)21-15(17)20-11)4-5-18-13(22)12(9)19-10(6)8/h1-3,19H,4-5,16H2,(H,18,22)(H3,17,20,21,23)
NCI pathway
Reactome pathway
n/an/a 187n/an/an/an/a7.2n/a
Genomics Institute of the Novartis Research Foundation
Assay Description
In vitro kinase assay using SPA assay kit from Amersham Pharmacia Biotech, Uk.
Chem Biol 11: 247-59 (2004)
Article DOI: 10.1016/j.chembiol.2004.01.015
BindingDB Entry DOI: 10.7270/Q2FN14M9
Glycogen synthase kinase-3 beta
(Homo sapiens (Human))
BDBM59114
(Hymenialdisine, 27i)
Show SMILES NC1=NC(=O)C(N1)=C1CCNC(=O)c2[nH]c3c(N)cccc3c12 |w:7.8,t:1|
Show InChI InChI=1S/C15H14N6O2/c16-8-3-1-2-6-9-7(11-14(23)21-15(17)20-11)4-5-18-13(22)12(9)19-10(6)8/h1-3,19H,4-5,16H2,(H,18,22)(H3,17,20,21,23)
NCI pathway
Reactome pathway
n/an/a 163n/an/an/an/a7.2n/a
Genomics Institute of the Novartis Research Foundation
Assay Description
In vitro kinase assay using SPA assay kit from Amersham Pharmacia Biotech, Uk.
Chem Biol 11: 247-59 (2004)
Article DOI: 10.1016/j.chembiol.2004.01.015
BindingDB Entry DOI: 10.7270/Q2FN14M9
Cyclin-dependent kinase 1
(Homo sapiens (Human))
BDBM59114
(Hymenialdisine, 27i)
Show SMILES NC1=NC(=O)C(N1)=C1CCNC(=O)c2[nH]c3c(N)cccc3c12 |w:7.8,t:1|
Show InChI InChI=1S/C15H14N6O2/c16-8-3-1-2-6-9-7(11-14(23)21-15(17)20-11)4-5-18-13(22)12(9)19-10(6)8/h1-3,19H,4-5,16H2,(H,18,22)(H3,17,20,21,23)
Reactome pathway
n/an/a 1.60E+3n/an/an/an/a7.2n/a
Genomics Institute of the Novartis Research Foundation
Assay Description
In vitro kinase assay using SPA assay kit from Amersham Pharmacia Biotech, Uk.
Chem Biol 11: 247-59 (2004)
Article DOI: 10.1016/j.chembiol.2004.01.015
BindingDB Entry DOI: 10.7270/Q2FN14M9