BDBM59128 Hymenialdisine, 28s
SMILES: Clc1[nH]c2c(c1Cl)C(CCNC2=O)=NNc1ccccn1
InChI Key: InChIKey=AWJACNYSMBTZTH-UHFFFAOYSA-N
Data: 2 IC50
Activity Spreadsheet -- Enzyme Inhibition Constant Data from BindingDB
Found 2 hits for monomerid = 59128
Trg + Lig
Ki
nM
ΔG°
kcal/mole
IC50
nM
Kd
nM
EC50/IC50
nM
koff
s-1
kon
M-1s-1
pHTemp
°C
Glycogen synthase kinase-3 beta
(Homo sapiens (Human))
BDBM59128
(Hymenialdisine, 28s)
Show SMILES Clc1[nH]c2c(c1Cl)C(CCNC2=O)=NNc1ccccn1 |w:13.15|
Show InChI InChI=1S/C13H11Cl2N5O/c14-10-9-7(19-20-8-3-1-2-5-16-8)4-6-17-13(21)11(9)18-12(10)15/h1-3,5,18H,4,6H2,(H,16,20)(H,17,21)
NCI pathway
Reactome pathway
n/an/a 6.99E+3n/an/an/an/a7.2n/a
Genomics Institute of the Novartis Research Foundation
Assay Description
In vitro kinase assay using SPA assay kit from Amersham Pharmacia Biotech, Uk.
Chem Biol 11: 247-59 (2004)
Article DOI: 10.1016/j.chembiol.2004.01.015
BindingDB Entry DOI: 10.7270/Q2FN14M9
Cyclin-dependent kinase 5 regulatory subunit 1
(Homo sapiens (Human))
BDBM59128
(Hymenialdisine, 28s)
Show SMILES Clc1[nH]c2c(c1Cl)C(CCNC2=O)=NNc1ccccn1 |w:13.15|
Show InChI InChI=1S/C13H11Cl2N5O/c14-10-9-7(19-20-8-3-1-2-5-16-8)4-6-17-13(21)11(9)18-12(10)15/h1-3,5,18H,4,6H2,(H,16,20)(H,17,21)
NCI pathway
Reactome pathway
n/an/a 6.91E+3n/an/an/an/a7.2n/a
Genomics Institute of the Novartis Research Foundation
Assay Description
In vitro kinase assay using SPA assay kit from Amersham Pharmacia Biotech, Uk.
Chem Biol 11: 247-59 (2004)
Article DOI: 10.1016/j.chembiol.2004.01.015
BindingDB Entry DOI: 10.7270/Q2FN14M9