BDBM59129 Hymenialdisine, 28f
SMILES: O=C1NCCC(=NNc2ccccn2)c2c1[nH]c1ccccc21
InChI Key: InChIKey=MGYTXFGAXIKJRJ-UHFFFAOYSA-N
Data: 2 IC50
Activity Spreadsheet -- Enzyme Inhibition Constant Data from BindingDB
Found 2 hits for monomerid = 59129
Trg + Lig
Ki
nM
ΔG°
kcal/mole
IC50
nM
Kd
nM
EC50/IC50
nM
koff
s-1
kon
M-1s-1
pHTemp
°C
Glycogen synthase kinase-3 beta
(Homo sapiens (Human))
BDBM59129
(Hymenialdisine, 28f)
Show SMILES O=C1NCCC(=NNc2ccccn2)c2c1[nH]c1ccccc21 |w:6.6|
Show InChI InChI=1S/C17H15N5O/c23-17-16-15(11-5-1-2-6-12(11)20-16)13(8-10-19-17)21-22-14-7-3-4-9-18-14/h1-7,9,20H,8,10H2,(H,18,22)(H,19,23)
NCI pathway
Reactome pathway
n/an/a 2.62E+3n/an/an/an/a7.2n/a
Genomics Institute of the Novartis Research Foundation
Assay Description
In vitro kinase assay using SPA assay kit from Amersham Pharmacia Biotech, Uk.
Chem Biol 11: 247-59 (2004)
Article DOI: 10.1016/j.chembiol.2004.01.015
BindingDB Entry DOI: 10.7270/Q2FN14M9
Cyclin-dependent kinase 5 regulatory subunit 1
(Homo sapiens (Human))
BDBM59129
(Hymenialdisine, 28f)
Show SMILES O=C1NCCC(=NNc2ccccn2)c2c1[nH]c1ccccc21 |w:6.6|
Show InChI InChI=1S/C17H15N5O/c23-17-16-15(11-5-1-2-6-12(11)20-16)13(8-10-19-17)21-22-14-7-3-4-9-18-14/h1-7,9,20H,8,10H2,(H,18,22)(H,19,23)
NCI pathway
Reactome pathway
n/an/a 757n/an/an/an/a7.2n/a
Genomics Institute of the Novartis Research Foundation
Assay Description
In vitro kinase assay using SPA assay kit from Amersham Pharmacia Biotech, Uk.
Chem Biol 11: 247-59 (2004)
Article DOI: 10.1016/j.chembiol.2004.01.015
BindingDB Entry DOI: 10.7270/Q2FN14M9