BDBM59132 Hymenialdisine, 28h
SMILES: Brc1ccc2[nH]c3c(C(CCNC3=O)=NNc3ccccn3)c2c1
InChI Key: InChIKey=VZPARCWZOQHETM-UHFFFAOYSA-N
Data: 2 IC50
Activity Spreadsheet -- Enzyme Inhibition Constant Data from BindingDB
Found 2 hits for monomerid = 59132
Trg + Lig
Ki
nM
ΔG°
kcal/mole
IC50
nM
Kd
nM
EC50/IC50
nM
koff
s-1
kon
M-1s-1
pHTemp
°C
Glycogen synthase kinase-3 beta
(Homo sapiens (Human))
BDBM59132
(Hymenialdisine, 28h)
Show SMILES Brc1ccc2[nH]c3c(C(CCNC3=O)=NNc3ccccn3)c2c1 |w:14.15|
Show InChI InChI=1S/C17H14BrN5O/c18-10-4-5-12-11(9-10)15-13(6-8-20-17(24)16(15)21-12)22-23-14-3-1-2-7-19-14/h1-5,7,9,21H,6,8H2,(H,19,23)(H,20,24)
NCI pathway
Reactome pathway
n/an/a 741n/an/an/an/a7.2n/a
Genomics Institute of the Novartis Research Foundation
Assay Description
In vitro kinase assay using SPA assay kit from Amersham Pharmacia Biotech, Uk.
Chem Biol 11: 247-59 (2004)
Article DOI: 10.1016/j.chembiol.2004.01.015
BindingDB Entry DOI: 10.7270/Q2FN14M9
Cyclin-dependent kinase 5 regulatory subunit 1
(Homo sapiens (Human))
BDBM59132
(Hymenialdisine, 28h)
Show SMILES Brc1ccc2[nH]c3c(C(CCNC3=O)=NNc3ccccn3)c2c1 |w:14.15|
Show InChI InChI=1S/C17H14BrN5O/c18-10-4-5-12-11(9-10)15-13(6-8-20-17(24)16(15)21-12)22-23-14-3-1-2-7-19-14/h1-5,7,9,21H,6,8H2,(H,19,23)(H,20,24)
NCI pathway
Reactome pathway
n/an/a 437n/an/an/an/a7.2n/a
Genomics Institute of the Novartis Research Foundation
Assay Description
In vitro kinase assay using SPA assay kit from Amersham Pharmacia Biotech, Uk.
Chem Biol 11: 247-59 (2004)
Article DOI: 10.1016/j.chembiol.2004.01.015
BindingDB Entry DOI: 10.7270/Q2FN14M9