BDBM59146 Hymenialdisine, 28w
SMILES: Fc1ccc2[nH]c3c(C(CCNC3=O)=NNc3cccnc3)c2c1
InChI Key: InChIKey=BBSNLVGUSKQSBU-UHFFFAOYSA-N
Data: 2 IC50
Activity Spreadsheet -- Enzyme Inhibition Constant Data from BindingDB
Found 2 hits for monomerid = 59146
Trg + Lig
Ki
nM
ΔG°
kcal/mole
IC50
nM
Kd
nM
EC50/IC50
nM
koff
s-1
kon
M-1s-1
pHTemp
°C
Glycogen synthase kinase-3 beta
(Homo sapiens (Human))
BDBM59146
(Hymenialdisine, 28w)
Show SMILES Fc1ccc2[nH]c3c(C(CCNC3=O)=NNc3cccnc3)c2c1 |w:14.15|
Show InChI InChI=1S/C17H14FN5O/c18-10-3-4-13-12(8-10)15-14(5-7-20-17(24)16(15)21-13)23-22-11-2-1-6-19-9-11/h1-4,6,8-9,21-22H,5,7H2,(H,20,24)
NCI pathway
Reactome pathway
n/an/a 557n/an/an/an/a7.2n/a
Genomics Institute of the Novartis Research Foundation
Assay Description
In vitro kinase assay using SPA assay kit from Amersham Pharmacia Biotech, Uk.
Chem Biol 11: 247-59 (2004)
Article DOI: 10.1016/j.chembiol.2004.01.015
BindingDB Entry DOI: 10.7270/Q2FN14M9
Cyclin-dependent kinase 5 regulatory subunit 1
(Homo sapiens (Human))
BDBM59146
(Hymenialdisine, 28w)
Show SMILES Fc1ccc2[nH]c3c(C(CCNC3=O)=NNc3cccnc3)c2c1 |w:14.15|
Show InChI InChI=1S/C17H14FN5O/c18-10-3-4-13-12(8-10)15-14(5-7-20-17(24)16(15)21-13)23-22-11-2-1-6-19-9-11/h1-4,6,8-9,21-22H,5,7H2,(H,20,24)
NCI pathway
Reactome pathway
n/an/a 12n/an/an/an/a7.2n/a
Genomics Institute of the Novartis Research Foundation
Assay Description
In vitro kinase assay using SPA assay kit from Amersham Pharmacia Biotech, Uk.
Chem Biol 11: 247-59 (2004)
Article DOI: 10.1016/j.chembiol.2004.01.015
BindingDB Entry DOI: 10.7270/Q2FN14M9