null
SMILES: CCOc1ccc(Cl)cc1\C=C1\SC(=S)N(CC)C1=O
InChI Key: InChIKey=NTAYAHYIYZZYEP-XYOKQWHBSA-N
Activity Spreadsheet -- Enzyme Inhibition Constant Data from BindingDB
Found 1 hit for monomerid = 59158
Trg + Lig
Ki
nM
ΔG°
kcal/mole
IC50
nM
Kd
nM
EC50/IC50
nM
koff
s-1
kon
M-1s-1
pHTemp
°C
Coagulation factor VIII
(Homo sapiens (Human))
BDBM59158
(6168356)
Show SMILES CCOc1ccc(Cl)cc1\C=C1\SC(=S)N(CC)C1=O
Show InChI InChI=1S/C14H14ClNO2S2/c1-3-16-13(17)12(20-14(16)19)8-9-7-10(15)5-6-11(9)18-4-2/h5-8H,3-4H2,1-2H3/b12-8+
Reactome pathway
n/an/a 4.96E+4n/an/an/an/an/a37
University of Washington
Assay Description
Inhibition of factor VIII C2 domain.
Chem Biol 11: 1413-22 (2004)
Article DOI: 10.1016/j.chembiol.2004.08.006
BindingDB Entry DOI: 10.7270/Q29W0CX1