BDBM59171 BN1
SMILES: O=S(=O)(Nc1ccc(NS(=O)(=O)c2cccc3ccccc23)cc1)c1cccc2ccccc12
InChI Key: InChIKey=SPPDPJNNCRRRGV-UHFFFAOYSA-N
Data: 1 Kd
Activity Spreadsheet -- Enzyme Inhibition Constant Data from BindingDB
Found 1 hit for monomerid = 59171
Trg + Lig
Ki
nM
ΔG°
kcal/mole
IC50
nM
Kd
nM
EC50/IC50
nM
koff
s-1
kon
M-1s-1
pHTemp
°C
Calmodulin
(Homo sapiens (Human))
BDBM59171
(BN1)
Show SMILES O=S(=O)(Nc1ccc(NS(=O)(=O)c2cccc3ccccc23)cc1)c1cccc2ccccc12
Show InChI InChI=1S/C26H20N2O4S2/c29-33(30,25-13-5-9-19-7-1-3-11-23(19)25)27-21-15-17-22(18-16-21)28-34(31,32)26-14-6-10-20-8-2-4-12-24(20)26/h1-18,27-28H
NCI pathway
Reactome pathway
n/an/an/a 70n/an/an/an/an/a
University of Sheffield
Assay Description
Experiments were conducted with HITACHI-4500 and Shimadzu RF-5301 fluorescence spectrophotometer.
Chem Biol 12: 89-97 (2005)
Article DOI: 10.1016/j.chembiol.2004.11.007
BindingDB Entry DOI: 10.7270/Q22B8WGR