BDBM59216 Pepstatin analog, 4
SMILES: CC(C)C[C@@H](NC(=O)[C@H](NC(=O)CCCCCCCCCCCCCCC(=O)N[C@H](CC(N)=O)C(=O)N[C@@H](Cc1ccccc1)C(O)=O)C(C)O)C(=O)NCCc1cccc(O)c1
InChI Key: InChIKey=FDMXXQQBWCZJMY-KUMZHBIPSA-N
Data: 1 KI  1 IC50
Activity Spreadsheet -- Enzyme Inhibition Constant Data from BindingDB
Found 1 hit for monomerid = 59216
Trg + Lig
Ki
nM
ΔG°
kcal/mole
IC50
nM
Kd
nM
EC50/IC50
nM
koff
s-1
kon
M-1s-1
pHTemp
°C
Human herpesvirus 1 protease
(Human herpesvirus 1 (strain 17) (HHV-1) (Human her...)
BDBM59216
(Pepstatin analog, 4)
Show SMILES CC(C)C[C@@H](NC(=O)[C@H](NC(=O)CCCCCCCCCCCCCCC(=O)N[C@H](CC(N)=O)C(=O)N[C@@H](Cc1ccccc1)C(O)=O)C(C)O)C(=O)NCCc1cccc(O)c1 |r|
Show InChI InChI=1S/C47H72N6O10/c1-32(2)28-37(44(59)49-27-26-35-22-19-23-36(55)29-35)51-46(61)43(33(3)54)53-42(58)25-18-13-11-9-7-5-4-6-8-10-12-17-24-41(57)50-38(31-40(48)56)45(60)52-39(47(62)63)30-34-20-15-14-16-21-34/h14-16,19-23,29,32-33,37-39,43,54-55H,4-13,17-18,24-28,30-31H2,1-3H3,(H2,48,56)(H,49,59)(H,50,57)(H,51,61)(H,52,60)(H,53,58)(H,62,63)/t33?,37-,38-,39+,43-/m1/s1
1.13E+3n/a 4.40E+3n/an/an/an/a5.52n/a
Purdue University
Assay Description
The competitive assay requires two inhibitors to act by a purely competitive mechanism, whereas the binding site of on the inhibitors has been establ...
Chem Biol 12: 439-44 (2005)
Article DOI: 10.1016/j.chembiol.2005.02.004
BindingDB Entry DOI: 10.7270/Q2JD4V68