BDBM5923 3-amino-N-(5-{[(5-tert-butyl-1,3-oxazol-2-yl)methyl]sulfanyl}-1,3-thiazol-2-yl)propanamide::BMS-387032 analog 13::N-[5-[[[5-(1,1-Dimethylethyl)-2-oxazolyl]methyl]thio]-2-thiazolyl]-2-aminoethanecarboxamide Hydrochloride
SMILES: CC(C)(C)c1cnc(CSc2cnc(NC(=O)CCN)s2)o1
InChI Key: InChIKey=DXMKWGLRSARKJA-UHFFFAOYSA-N
Data: 1 IC50
Activity Spreadsheet -- Enzyme Inhibition Constant Data from BindingDB
Found 1 hit for monomerid = 5923
Trg + Lig
Ki
nM
ΔG°
kcal/mole
IC50
nM
Kd
nM
EC50/IC50
nM
koff
s-1
kon
M-1s-1
pHTemp
°C
CDK2/CycE
(Homo sapiens (Human))
BDBM5923
(3-amino-N-(5-{[(5-tert-butyl-1,3-oxazol-2-yl)methy...)
Show SMILES CC(C)(C)c1cnc(CSc2cnc(NC(=O)CCN)s2)o1
Show InChI InChI=1S/C14H20N4O2S2/c1-14(2,3)9-6-16-11(20-9)8-21-12-7-17-13(22-12)18-10(19)4-5-15/h6-7H,4-5,8,15H2,1-3H3,(H,17,18,19)
n/an/a 21n/an/an/an/a8.030
Bristol-Myers Squibb Company
Assay Description
The enzyme was assayed with substrate in the presence of 25 uM ATP/[gamma-33P] ATP and test compound. Dose response curves were generated to determ...
J Med Chem 47: 1719-28 (2004)
Article DOI: 10.1021/jm0305568
BindingDB Entry DOI: 10.7270/Q26971SZ