BDBM5924 BMS-387032 analog 14::N-(5-{[(5-tert-butyl-1,3-oxazol-2-yl)methyl]sulfanyl}-1,3-thiazol-2-yl)-2-phenylacetamide::N-[5-[[[5-(1,1-Dimethylethyl)-2-oxazolyl]methyl]thio]-2-thiazolyl]phenylmethanecarboxamide Trifluoroacetic Acid Salt
SMILES: CC(C)(C)c1cnc(CSc2cnc(NC(=O)Cc3ccccc3)s2)o1
InChI Key: InChIKey=BGUWRJYBIRDXKI-UHFFFAOYSA-N
Data: 1 IC50
Activity Spreadsheet -- Enzyme Inhibition Constant Data from BindingDB
Found 1 hit for monomerid = 5924
Trg + Lig
Ki
nM
ΔG°
kcal/mole
IC50
nM
Kd
nM
EC50/IC50
nM
koff
s-1
kon
M-1s-1
pHTemp
°C
CDK2/CycE
(Homo sapiens (Human))
BDBM5924
(BMS-387032 analog 14 | N-(5-{[(5-tert-butyl-1,3-ox...)
Show SMILES CC(C)(C)c1cnc(CSc2cnc(NC(=O)Cc3ccccc3)s2)o1
Show InChI InChI=1S/C19H21N3O2S2/c1-19(2,3)14-10-20-16(24-14)12-25-17-11-21-18(26-17)22-15(23)9-13-7-5-4-6-8-13/h4-8,10-11H,9,12H2,1-3H3,(H,21,22,23)
n/an/a 3n/an/an/an/a8.030
Bristol-Myers Squibb Company
Assay Description
The enzyme was assayed with substrate in the presence of 25 uM ATP/[gamma-33P] ATP and test compound. Dose response curves were generated to determ...
J Med Chem 47: 1719-28 (2004)
Article DOI: 10.1021/jm0305568
BindingDB Entry DOI: 10.7270/Q26971SZ