BDBM5932 1-Methyl-N-[5-[[[5-(1,1-dimethylethyl)-2-oxazolyl]methyl]thio]-2-thiazolyl]-4-piperidinecarboxamide::BMS-387032 analog 22::N-(5-{[(5-tert-butyl-1,3-oxazol-2-yl)methyl]sulfanyl}-1,3-thiazol-2-yl)-1-methylpiperidine-4-carboxamide
SMILES: CN1CCC(CC1)C(=O)Nc1ncc(SCc2ncc(o2)C(C)(C)C)s1
InChI Key: InChIKey=DVCYUACFNQICAO-UHFFFAOYSA-N
Data: 1 IC50
Activity Spreadsheet -- Enzyme Inhibition Constant Data from BindingDB
Found 1 hit for monomerid = 5932
Trg + Lig
Ki
nM
ΔG°
kcal/mole
IC50
nM
Kd
nM
EC50/IC50
nM
koff
s-1
kon
M-1s-1
pHTemp
°C
CDK2/CycE
(Homo sapiens (Human))
BDBM5932
(1-Methyl-N-[5-[[[5-(1,1-dimethylethyl)-2-oxazolyl]...)
Show SMILES CN1CCC(CC1)C(=O)Nc1ncc(SCc2ncc(o2)C(C)(C)C)s1
Show InChI InChI=1S/C18H26N4O2S2/c1-18(2,3)13-9-19-14(24-13)11-25-15-10-20-17(26-15)21-16(23)12-5-7-22(4)8-6-12/h9-10,12H,5-8,11H2,1-4H3,(H,20,21,23)
n/an/a 43n/an/an/an/a8.030
Bristol-Myers Squibb Company
Assay Description
The enzyme was assayed with substrate in the presence of 25 uM ATP/[gamma-33P] ATP and test compound. Dose response curves were generated to determ...
J Med Chem 47: 1719-28 (2004)
Article DOI: 10.1021/jm0305568
BindingDB Entry DOI: 10.7270/Q26971SZ