BDBM5933 BMS-387032 analog 23::N-(5-{[(5-tert-butyl-1,3-oxazol-2-yl)methyl]sulfanyl}-1,3-thiazol-2-yl)-1-(2-hydroxyethyl)piperidine-4-carboxamide::N-[5-[[[5-(1,1-Dimethylethyl)-2-oxazolyl]methyl]thio]-2-thiazolyl]-1-(2-hydroxyethyl)-4-piperidinecarboxamide
SMILES: CC(C)(C)c1cnc(CSc2cnc(NC(=O)C3CCN(CCO)CC3)s2)o1
InChI Key: InChIKey=NASKBLMGBFRGIF-UHFFFAOYSA-N
Data: 1 IC50
Activity Spreadsheet -- Enzyme Inhibition Constant Data from BindingDB
Found 1 hit for monomerid = 5933
Trg + Lig
Ki
nM
ΔG°
kcal/mole
IC50
nM
Kd
nM
EC50/IC50
nM
koff
s-1
kon
M-1s-1
pHTemp
°C
CDK2/CycE
(Homo sapiens (Human))
BDBM5933
(BMS-387032 analog 23 | N-(5-{[(5-tert-butyl-1,3-ox...)
Show SMILES CC(C)(C)c1cnc(CSc2cnc(NC(=O)C3CCN(CCO)CC3)s2)o1
Show InChI InChI=1S/C19H28N4O3S2/c1-19(2,3)14-10-20-15(26-14)12-27-16-11-21-18(28-16)22-17(25)13-4-6-23(7-5-13)8-9-24/h10-11,13,24H,4-9,12H2,1-3H3,(H,21,22,25)
n/an/a 74n/an/an/an/a8.030
Bristol-Myers Squibb Company
Assay Description
The enzyme was assayed with substrate in the presence of 25 uM ATP/[gamma-33P] ATP and test compound. Dose response curves were generated to determ...
J Med Chem 47: 1719-28 (2004)
Article DOI: 10.1021/jm0305568
BindingDB Entry DOI: 10.7270/Q26971SZ