BDBM59631 MLS000048432::N-(2,3-dihydro-1H-inden-5-yl)-2-(4-oxidanylidene-1,2,3-benzotriazin-3-yl)ethanamide::N-(2,3-dihydro-1H-inden-5-yl)-2-(4-oxo-1,2,3-benzotriazin-3-yl)acetamide::N-indan-5-yl-2-(4-keto-1,2,3-benzotriazin-3-yl)acetamide::SMR000065338::cid_2695552
SMILES: O=C(Cn1nnc2ccccc2c1=O)Nc1ccc2CCCc2c1
InChI Key: InChIKey=QQQJTLGSGFEOFE-UHFFFAOYSA-N
Data: 1 IC50
Activity Spreadsheet -- Enzyme Inhibition Constant Data from BindingDB
Found 1 hit for monomerid = 59631
Trg + Lig
Ki
nM
ΔG°
kcal/mole
IC50
nM
Kd
nM
EC50/IC50
nM
koff
s-1
kon
M-1s-1
pHTemp
°C
M17 leucyl aminopeptidase
(Plasmodium falciparum 3D7)
BDBM59631
(MLS000048432 | N-(2,3-dihydro-1H-inden-5-yl)-2-(4-...)
Show SMILES O=C(Cn1nnc2ccccc2c1=O)Nc1ccc2CCCc2c1
Show InChI InChI=1S/C18H16N4O2/c23-17(19-14-9-8-12-4-3-5-13(12)10-14)11-22-18(24)15-6-1-2-7-16(15)20-21-22/h1-2,6-10H,3-5,11H2,(H,19,23)
PCBioAssay
n/an/a 1.51E+3n/an/an/an/an/an/a
SRMLSC
Curated by PubChem BioAssay
Assay Description
Southern Research Molecular Libraries Screening Center (SRMLSC) Southern Research Institute (Birmingham, Alabama) NIH Molecular Libraries Screening...
PubChem Bioassay (2009)
BindingDB Entry DOI: 10.7270/Q27W69N8