BDBM59952 2-[2-(3-Ethyl-quinolin-2-ylsulfanyl)-acetylamino]-4,5-dimethoxy-benzoic acid::2-[2-(3-ethylquinolin-2-yl)sulfanylethanoylamino]-4,5-dimethoxy-benzoic acid::2-[[2-(3-ethylquinolin-2-yl)sulfanylacetyl]amino]-4,5-dimethoxybenzoic acid::2-[[2-[(3-ethyl-2-quinolinyl)thio]-1-oxoethyl]amino]-4,5-dimethoxybenzoic acid::2-[[2-[(3-ethyl-2-quinolyl)thio]acetyl]amino]-4,5-dimethoxy-benzoic acid::MLS000548290::SMR000171062::cid_3207888
SMILES: CCc1cc2ccccc2nc1SCC(=O)Nc1cc(OC)c(OC)cc1C(O)=O
InChI Key: InChIKey=YWVAYGMXZUMNPE-UHFFFAOYSA-N
Data: 2 IC50
Activity Spreadsheet -- Enzyme Inhibition Constant Data from BindingDB
Found 2 hits for monomerid = 59952
Trg + Lig
Ki
nM
ΔG°
kcal/mole
IC50
nM
Kd
nM
EC50/IC50
nM
koff
s-1
kon
M-1s-1
pHTemp
°C
Procathepsin L
(Homo sapiens (Human))
BDBM59952
(2-[2-(3-Ethyl-quinolin-2-ylsulfanyl)-acetylamino]-...)
Show SMILES CCc1cc2ccccc2nc1SCC(=O)Nc1cc(OC)c(OC)cc1C(O)=O
Show InChI InChI=1S/C22H22N2O5S/c1-4-13-9-14-7-5-6-8-16(14)24-21(13)30-12-20(25)23-17-11-19(29-3)18(28-2)10-15(17)22(26)27/h5-11H,4,12H2,1-3H3,(H,23,25)(H,26,27)
Reactome pathway
PCBioAssay
n/an/a>5.96E+4n/an/an/an/an/an/a
The Scripps Research Institute Molecular Screening Center
Curated by PubChem BioAssay
Assay Description
Source (MLPCN Center Name): The Scripps Research Institute Molecular Screening Center Affiliation: The Scripps Research Institute, TSRI Assay Provide...
PubChem Bioassay (2009)
BindingDB Entry DOI: 10.7270/Q2NZ8631
leucine aminopeptidase
(Plasmodium falciparum 3D7)
BDBM59952
(2-[2-(3-Ethyl-quinolin-2-ylsulfanyl)-acetylamino]-...)
Show SMILES CCc1cc2ccccc2nc1SCC(=O)Nc1cc(OC)c(OC)cc1C(O)=O
Show InChI InChI=1S/C22H22N2O5S/c1-4-13-9-14-7-5-6-8-16(14)24-21(13)30-12-20(25)23-17-11-19(29-3)18(28-2)10-15(17)22(26)27/h5-11H,4,12H2,1-3H3,(H,23,25)(H,26,27)
PCBioAssay
n/an/a 1.00E+3n/an/an/an/an/an/a
SRMLSC
Curated by PubChem BioAssay
Assay Description
Southern Research Molecular Libraries Screening Center (SRMLSC) Southern Research Institute (Birmingham, Alabama) NIH Molecular Libraries Screening...
PubChem Bioassay (2009)
BindingDB Entry DOI: 10.7270/Q27W69N8