BDBM60070 3-(4-fluorophenyl)-1H-pyrazol-5-ol::5-(4-fluorophenyl)-1,2-dihydropyrazol-3-one::5-(4-fluorophenyl)-3-pyrazolin-3-one::MLS000705455::SMR000230711::cid_1202215
SMILES: Fc1ccc(cc1)-c1cc(=O)[nH][nH]1
InChI Key: InChIKey=RMAVMOKRUUXLTL-UHFFFAOYSA-N
Data: 2 IC50
Activity Spreadsheet -- Enzyme Inhibition Constant Data from BindingDB
Found 2 hits for monomerid = 60070
Trg + Lig
Ki
nM
ΔG°
kcal/mole
IC50
nM
Kd
nM
EC50/IC50
nM
koff
s-1
kon
M-1s-1
pHTemp
°C
Procathepsin L
(Homo sapiens (Human))
BDBM60070
(3-(4-fluorophenyl)-1H-pyrazol-5-ol | 5-(4-fluoroph...)
Show SMILES Fc1ccc(cc1)-c1cc(=O)[nH][nH]1
Show InChI InChI=1S/C9H5FN2O/c10-7-3-1-6(2-4-7)8-5-9(13)12-11-8/h1-5H
Reactome pathway
PCBioAssay
n/an/a>5.96E+4n/an/an/an/an/an/a
The Scripps Research Institute Molecular Screening Center
Curated by PubChem BioAssay
Assay Description
Source (MLPCN Center Name): The Scripps Research Institute Molecular Screening Center Affiliation: The Scripps Research Institute, TSRI Assay Provide...
PubChem Bioassay (2009)
BindingDB Entry DOI: 10.7270/Q2NZ8631
leucine aminopeptidase
(Plasmodium falciparum 3D7)
BDBM60070
(3-(4-fluorophenyl)-1H-pyrazol-5-ol | 5-(4-fluoroph...)
Show SMILES Fc1ccc(cc1)-c1cc(=O)[nH][nH]1
Show InChI InChI=1S/C9H5FN2O/c10-7-3-1-6(2-4-7)8-5-9(13)12-11-8/h1-5H
PCBioAssay
n/an/a 1.13E+3n/an/an/an/an/an/a
SRMLSC
Curated by PubChem BioAssay
Assay Description
Southern Research Molecular Libraries Screening Center (SRMLSC) Southern Research Institute (Birmingham, Alabama) NIH Molecular Libraries Screening...
PubChem Bioassay (2009)
BindingDB Entry DOI: 10.7270/Q27W69N8