BDBM60374 MLS000047422::N-[4-(dimethylamino)phenyl]-2-[4-(2-fluorophenyl)-1-piperazinyl]acetamide::N-[4-(dimethylamino)phenyl]-2-[4-(2-fluorophenyl)piperazin-1-yl]acetamide::N-[4-(dimethylamino)phenyl]-2-[4-(2-fluorophenyl)piperazin-1-yl]ethanamide::N-[4-(dimethylamino)phenyl]-2-[4-(2-fluorophenyl)piperazino]acetamide::SMR000033433::cid_3235936
SMILES: CN(C)c1ccc(NC(=O)CN2CCN(CC2)c2ccccc2F)cc1
InChI Key: InChIKey=YRXQALNJIZRTCU-UHFFFAOYSA-N
Data: 1 IC50
Activity Spreadsheet -- Enzyme Inhibition Constant Data from BindingDB
Found 1 hit for monomerid = 60374
Trg + Lig
Ki
nM
ΔG°
kcal/mole
IC50
nM
Kd
nM
EC50/IC50
nM
koff
s-1
kon
M-1s-1
pHTemp
°C
Large T antigen
(Simian virus 40)
BDBM60374
(MLS000047422 | N-[4-(dimethylamino)phenyl]-2-[4-(2...)
Show SMILES CN(C)c1ccc(NC(=O)CN2CCN(CC2)c2ccccc2F)cc1
Show InChI InChI=1S/C20H25FN4O/c1-23(2)17-9-7-16(8-10-17)22-20(26)15-24-11-13-25(14-12-24)19-6-4-3-5-18(19)21/h3-10H,11-15H2,1-2H3,(H,22,26)
PCBioAssay
n/an/a 7.19E+3n/an/an/an/an/an/a
Southern Research Specialized Biocontainment Screening Center
Curated by PubChem BioAssay
Assay Description
A biochemical assay using the ADP-Hunter methodology, purified TAg, and ATP to identify compounds that inhibit the ATPase activity of Tag Southern Re...
PubChem Bioassay (2010)
BindingDB Entry DOI: 10.7270/Q2M61HQ8