BDBM60586 4-(4-{3-[1-(2,6-dichloro-3-fluorophenyl)ethyl]-1H-pyrrolo[2,3-b]pyridin-5-yl}-1H-pyrazol-1-yl)piperidine (1)
SMILES: CC(c1c[nH]c2ncc(cc12)-c1cnn(c1)C1CCNCC1)c1c(Cl)ccc(F)c1Cl
InChI Key:
Data: 1 IC50
Activity Spreadsheet -- Enzyme Inhibition Constant Data from BindingDB
Found 1 hit for monomerid = 60586
Trg + Lig
Ki
nM
ΔG°
kcal/mole
IC50
nM
Kd
nM
EC50/IC50
nM
koff
s-1
kon
M-1s-1
pHTemp
°C
Tyrosine kinase receptor c-Met (c-Met)
(Homo sapiens (Human))
BDBM60586
(4-(4-{3-[1-(2,6-dichloro-3-fluorophenyl)ethyl]-1H-...)
Show SMILES CC(c1c[nH]c2ncc(cc12)-c1cnn(c1)C1CCNCC1)c1c(Cl)ccc(F)c1Cl
n/an/a<100n/an/an/an/a7.025
Tianjin University of Science and Technology
Assay Description
The c-Met kinase activity of five target compounds and three positive compounds were evaluated using standard Z-LYTE Assays (fluorescence resonance e...
Bioorg Chem 65: 146-58 (2016)
Article DOI: 10.1016/j.bioorg.2016.02.009
BindingDB Entry DOI: 10.7270/Q2VT1QVX