BDBM60724 2-(3,4-dihydroxyphenyl)-5,7-dihydroxy-6-(3,4,5-trihydroxy-6-methylol-tetrahydropyran-2-yl)chromone::2-(3,4-dihydroxyphenyl)-5,7-dihydroxy-6-[3,4,5-trihydroxy-6-(hydroxymethyl)-2-oxanyl]-1-benzopyran-4-one::2-(3,4-dihydroxyphenyl)-5,7-dihydroxy-6-[3,4,5-trihydroxy-6-(hydroxymethyl)oxan-2-yl]chromen-4-one::2-[3,4-bis(oxidanyl)phenyl]-6-[6-(hydroxymethyl)-3,4,5-tris(oxidanyl)oxan-2-yl]-5,7-bis(oxidanyl)chromen-4-one::MLS000876959::SMR000440666::cid_6426860
SMILES: OCC1OC(C(O)C(O)C1O)c1c(O)cc2oc(cc(=O)c2c1O)-c1ccc(O)c(O)c1
InChI Key: InChIKey=ODBRNZZJSYPIDI-UHFFFAOYSA-N
Data: 2 IC50
PDB links: 1 PDB ID matches this monomer.
Activity Spreadsheet -- Enzyme Inhibition Constant Data from BindingDB
Found 2 hits for monomerid = 60724
Trg + Lig
Ki
nM
ΔG°
kcal/mole
IC50
nM
Kd
nM
EC50/IC50
nM
koff
s-1
kon
M-1s-1
pHTemp
°C
lens epithelium-derived growth factor p75
(Homo sapiens (Human))
BDBM60724
(2-(3,4-dihydroxyphenyl)-5,7-dihydroxy-6-(3,4,5-tri...)
Show SMILES OCC1OC(C(O)C(O)C1O)c1c(O)cc2oc(cc(=O)c2c1O)-c1ccc(O)c(O)c1
Show InChI InChI=1S/C21H20O11/c22-6-14-17(27)19(29)20(30)21(32-14)16-11(26)5-13-15(18(16)28)10(25)4-12(31-13)7-1-2-8(23)9(24)3-7/h1-5,14,17,19-24,26-30H,6H2
Reactome pathway
PCBioAssay
n/an/a 1.55E+3n/an/an/an/an/an/a
The Scripps Research Institute Molecular Screening Center
Curated by PubChem BioAssay
Assay Description
Source (MLPCN Center Name): The Scripps Research Institute Molecular Screening Center (SRIMSC) Affiliation: Ohio State University Assay Provider: Mam...
PubChem Bioassay (2014)
BindingDB Entry DOI: 10.7270/Q2KD1WKS
lens epithelium-derived growth factor p75
(Homo sapiens (Human))
BDBM60724
(2-(3,4-dihydroxyphenyl)-5,7-dihydroxy-6-(3,4,5-tri...)
Show SMILES OCC1OC(C(O)C(O)C1O)c1c(O)cc2oc(cc(=O)c2c1O)-c1ccc(O)c(O)c1
Show InChI InChI=1S/C21H20O11/c22-6-14-17(27)19(29)20(30)21(32-14)16-11(26)5-13-15(18(16)28)10(25)4-12(31-13)7-1-2-8(23)9(24)3-7/h1-5,14,17,19-24,26-30H,6H2
Reactome pathway
PCBioAssay
n/an/a 197n/an/an/an/an/an/a
The Scripps Research Institute Molecular Screening Center
Curated by PubChem BioAssay
Assay Description
Source (MLPCN Center Name): The Scripps Research Institute Molecular Screening Center (SRIMSC) Affiliation: Ohio State University Assay Provider: Mam...
PubChem Bioassay (2014)
BindingDB Entry DOI: 10.7270/Q2Q52N9H