BDBM60858 4-[2-(1-naphthalenylamino)-4-thiazolyl]benzene-1,2-diol;hydrochloride::4-[2-(1-naphthylamino)thiazol-4-yl]pyrocatechol;hydrochloride::4-[2-(naphthalen-1-ylamino)-1,3-thiazol-4-yl]benzene-1,2-diol;hydrochloride::MLS001183598::SMR000502770::cid_23724291
SMILES: Oc1ccc(cc1O)-c1csc(Nc2cccc3ccccc23)n1
InChI Key: InChIKey=HBKZMXMDUOPHJE-UHFFFAOYSA-N
Data: 4 IC50
Activity Spreadsheet -- Enzyme Inhibition Constant Data from BindingDB
Found 4 hits for monomerid = 60858
Trg + Lig
Ki
nM
ΔG°
kcal/mole
IC50
nM
Kd
nM
EC50/IC50
nM
koff
s-1
kon
M-1s-1
pHTemp
°C
Intestinal alkaline phosphatase
(Homo sapiens (Human))
BDBM60858
(4-[2-(1-naphthalenylamino)-4-thiazolyl]benzene-1,2...)
Show SMILES Oc1ccc(cc1O)-c1csc(Nc2cccc3ccccc23)n1
Show InChI InChI=1S/C19H14N2O2S/c22-17-9-8-13(10-18(17)23)16-11-24-19(21-16)20-15-7-3-5-12-4-1-2-6-14(12)15/h1-11,22-23H,(H,20,21)
PCBioAssay
n/an/a 3.36E+3n/an/an/an/an/an/a
Burnham Center for Chemical Genomics
Curated by PubChem BioAssay
Assay Description
Data Source: Sanford-Burnham Center for Chemical Genomics (SBCCG) Source Affiliation: Sanford-Burnham Medical Research Institute(SBMRI, San Diego, CA...
PubChem Bioassay (2010)
BindingDB Entry DOI: 10.7270/Q2X63KDM
Alpi
(Rattus norvegicus (Rat))
BDBM60858
(4-[2-(1-naphthalenylamino)-4-thiazolyl]benzene-1,2...)
Show SMILES Oc1ccc(cc1O)-c1csc(Nc2cccc3ccccc23)n1
Show InChI InChI=1S/C19H14N2O2S/c22-17-9-8-13(10-18(17)23)16-11-24-19(21-16)20-15-7-3-5-12-4-1-2-6-14(12)15/h1-11,22-23H,(H,20,21)
PCBioAssay
n/an/a 1.63E+3n/an/an/an/an/an/a
Burnham Center for Chemical Genomics
Curated by PubChem BioAssay
Assay Description
Data Source: Sanford-Burnham Center for Chemical Genomics (SBCCG) Source Affiliation: Sanford-Burnham Medical Research Institute (SBMRI, San Diego, C...
PubChem Bioassay (2010)
BindingDB Entry DOI: 10.7270/Q2DB809V
Alkaline phosphatase, tissue-nonspecific isozyme
(Homo sapiens (Human))
BDBM60858
(4-[2-(1-naphthalenylamino)-4-thiazolyl]benzene-1,2...)
Show SMILES Oc1ccc(cc1O)-c1csc(Nc2cccc3ccccc23)n1
Show InChI InChI=1S/C19H14N2O2S/c22-17-9-8-13(10-18(17)23)16-11-24-19(21-16)20-15-7-3-5-12-4-1-2-6-14(12)15/h1-11,22-23H,(H,20,21)
PCBioAssay
n/an/a 7.80E+4n/an/an/an/an/an/a
Burnham Center for Chemical Genomics
Curated by PubChem BioAssay
Assay Description
Data Source: Sanford-Burnham Center for Chemical Genomics (SBCCG) Source Affiliation: Sanford-Burnham Medical Research Institute (SBMRI, San Diego, C...
PubChem Bioassay (2010)
BindingDB Entry DOI: 10.7270/Q2H130G1
Alkaline phosphatase placental-like
(Homo sapiens (Human))
BDBM60858
(4-[2-(1-naphthalenylamino)-4-thiazolyl]benzene-1,2...)
Show SMILES Oc1ccc(cc1O)-c1csc(Nc2cccc3ccccc23)n1
Show InChI InChI=1S/C19H14N2O2S/c22-17-9-8-13(10-18(17)23)16-11-24-19(21-16)20-15-7-3-5-12-4-1-2-6-14(12)15/h1-11,22-23H,(H,20,21)
PCBioAssay
n/an/a>1.00E+5n/an/an/an/an/an/a
Burnham Center for Chemical Genomics
Curated by PubChem BioAssay
Assay Description
Data Source: Sanford-Burnham Center for Chemical Genomics (SBCCG) Source Affiliation: Sanford-Burnham Medical Research Institute (SBMRI, San Diego, C...
PubChem Bioassay (2010)
BindingDB Entry DOI: 10.7270/Q2NS0SCW