BDBM6095 3-quinolinecarbonitrile 23::4-[(2,4-Dichloro-5-methoxyphenyl)amino]-6-methoxy-7-[2-(1-methylpiperidin-4-yl)ethoxy]-3-quinolinecarbonitrile::4-[(2,4-dichloro-5-methoxyphenyl)amino]-6-methoxy-7-[2-(1-methylpiperidin-4-yl)ethoxy]quinoline-3-carbonitrile::4-phenylamino-3-quinolinecarbonitrile 6
SMILES: COc1cc(Nc2c(cnc3cc(OCCC4CCN(C)CC4)c(OC)cc23)C#N)c(Cl)cc1Cl
InChI Key: InChIKey=FCIILWHQWNLPJU-UHFFFAOYSA-N
Data: 5 IC50
Activity Spreadsheet -- Enzyme Inhibition Constant Data from BindingDB
Found 5 hits for monomerid = 6095
Trg + Lig
Ki
nM
ΔG°
kcal/mole
IC50
nM
Kd
nM
EC50/IC50
nM
koff
s-1
kon
M-1s-1
pHTemp
°C
Proto-oncogene tyrosine-protein kinase Src
(Homo sapiens (Human))
BDBM6095
(3-quinolinecarbonitrile 23 | 4-[(2,4-Dichloro-5-me...)
Show SMILES COc1cc(Nc2c(cnc3cc(OCCC4CCN(C)CC4)c(OC)cc23)C#N)c(Cl)cc1Cl
Show InChI InChI=1S/C26H28Cl2N4O3/c1-32-7-4-16(5-8-32)6-9-35-25-12-21-18(10-24(25)34-3)26(17(14-29)15-30-21)31-22-13-23(33-2)20(28)11-19(22)27/h10-13,15-16H,4-9H2,1-3H3,(H,30,31)
n/an/a 7.70n/an/an/an/an/an/a
Wyeth Research
Assay Description
Kinase assays were performed using the europium/APC detection format (LANCE, Perkin Elmer). HTRF is based on the proximity of europium cryptate (dono...
J Med Chem 48: 3891-902 (2005)
Article DOI: 10.1021/jm050175p
BindingDB Entry DOI: 10.7270/Q2T43R88
Tyrosine-protein kinase ABL1
(Homo sapiens (Human))
BDBM6095
(3-quinolinecarbonitrile 23 | 4-[(2,4-Dichloro-5-me...)
Show SMILES COc1cc(Nc2c(cnc3cc(OCCC4CCN(C)CC4)c(OC)cc23)C#N)c(Cl)cc1Cl
Show InChI InChI=1S/C26H28Cl2N4O3/c1-32-7-4-16(5-8-32)6-9-35-25-12-21-18(10-24(25)34-3)26(17(14-29)15-30-21)31-22-13-23(33-2)20(28)11-19(22)27/h10-13,15-16H,4-9H2,1-3H3,(H,30,31)
Reactome pathway
n/an/a 2.90n/an/an/an/an/an/a
Wyeth Research
Assay Description
Kinase assays were performed using the europium/APC detection format (LANCE, Perkin Elmer). HTRF is based on the proximity of europium cryptate (dono...
J Med Chem 48: 3891-902 (2005)
Article DOI: 10.1021/jm050175p
BindingDB Entry DOI: 10.7270/Q2T43R88
Tyrosine-protein kinase ABL
(Homo sapiens (Human))
BDBM6095
(3-quinolinecarbonitrile 23 | 4-[(2,4-Dichloro-5-me...)
Show SMILES COc1cc(Nc2c(cnc3cc(OCCC4CCN(C)CC4)c(OC)cc23)C#N)c(Cl)cc1Cl
Show InChI InChI=1S/C26H28Cl2N4O3/c1-32-7-4-16(5-8-32)6-9-35-25-12-21-18(10-24(25)34-3)26(17(14-29)15-30-21)31-22-13-23(33-2)20(28)11-19(22)27/h10-13,15-16H,4-9H2,1-3H3,(H,30,31)
n/an/a 2.90n/an/an/an/an/an/a
Wyeth Research
Curated by ChEMBL
Assay Description
Inhibition of Abl kinase
J Med Chem 47: 1599-601 (2004)
Article DOI: 10.1021/jm0499458
BindingDB Entry DOI: 10.7270/Q2BP05HD
Calmodulin/Proto-oncogene tyrosine-protein kinase Src
(Homo sapiens (Human))
BDBM6095
(3-quinolinecarbonitrile 23 | 4-[(2,4-Dichloro-5-me...)
Show SMILES COc1cc(Nc2c(cnc3cc(OCCC4CCN(C)CC4)c(OC)cc23)C#N)c(Cl)cc1Cl
Show InChI InChI=1S/C26H28Cl2N4O3/c1-32-7-4-16(5-8-32)6-9-35-25-12-21-18(10-24(25)34-3)26(17(14-29)15-30-21)31-22-13-23(33-2)20(28)11-19(22)27/h10-13,15-16H,4-9H2,1-3H3,(H,30,31)
n/an/a 7.70n/an/an/an/an/an/a
Wyeth Research
Curated by ChEMBL
Assay Description
Inhibition of recombinant human Src kinase
J Med Chem 47: 1599-601 (2004)
Article DOI: 10.1021/jm0499458
BindingDB Entry DOI: 10.7270/Q2BP05HD
Proto-oncogene tyrosine-protein kinase Src
(Homo sapiens (Human))
BDBM6095
(3-quinolinecarbonitrile 23 | 4-[(2,4-Dichloro-5-me...)
Show SMILES COc1cc(Nc2c(cnc3cc(OCCC4CCN(C)CC4)c(OC)cc23)C#N)c(Cl)cc1Cl
Show InChI InChI=1S/C26H28Cl2N4O3/c1-32-7-4-16(5-8-32)6-9-35-25-12-21-18(10-24(25)34-3)26(17(14-29)15-30-21)31-22-13-23(33-2)20(28)11-19(22)27/h10-13,15-16H,4-9H2,1-3H3,(H,30,31)
n/an/a 2.40n/an/an/an/an/an/a
Wyeth Research
Assay Description
Src kinase activity was measured in an ELISA format. IC50 is the inhibitor concentration which inhibits 50% of kinase activity that catalyzes the tra...
Bioorg Med Chem Lett 13: 3797-800 (2003)
Article DOI: 10.1016/j.bmcl.2003.07.001
BindingDB Entry DOI: 10.7270/Q27942VF