BDBM60993 US9416103, JWH-073-M5
SMILES: OCCCCn1cc(C(=O)c2cccc3ccccc23)c2ccccc12
InChI Key: InChIKey=FIBVDFAPDNJBNI-UHFFFAOYSA-N
Data: 1 KI
Activity Spreadsheet -- Enzyme Inhibition Constant Data from BindingDB
Found 1 hit for monomerid = 60993
Trg + Lig
Ki
nM
ΔG°
kcal/mole
IC50
nM
Kd
nM
EC50/IC50
nM
koff
s-1
kon
M-1s-1
pHTemp
°C
Cannabinoid receptor 1
(Mus musculus (Mouse))
BDBM60993
(US9416103, JWH-073-M5)
Show SMILES OCCCCn1cc(C(=O)c2cccc3ccccc23)c2ccccc12
Show InChI InChI=1S/C23H21NO2/c25-15-6-5-14-24-16-21(19-11-3-4-13-22(19)24)23(26)20-12-7-9-17-8-1-2-10-18(17)20/h1-4,7-13,16,25H,5-6,14-15H2
US Patent
224 -9.06n/an/an/an/an/an/a25
The Board of Trustees of the University of Arkansas; The University of Kansas
US Patent
Assay Description
Competition receptor binding was performed as previously described [Shoemaker et al., J. Pharmacol. Exp. Ther., 314:868-75]. Briefly, 50 μg of mou...
US Patent US9416103 (2016)
BindingDB Entry DOI: 10.7270/Q2HX1BKQ