null
SMILES: CCN(CC)CCCNc1cc2nc(NC(=O)NC(C)(C)C)c(cc2cn1)-c1cc(OC)cc(OC)c1
InChI Key: InChIKey=SADVQUINRBCGFP-UHFFFAOYSA-N
Activity Spreadsheet -- Enzyme Inhibition Constant Data from BindingDB
Found 4 hits for monomerid = 6149
Trg + Lig
Ki
nM
ΔG°
kcal/mole
IC50
nM
Kd
nM
EC50/IC50
nM
koff
s-1
kon
M-1s-1
pHTemp
°C
Platelet-derived growth factor receptor beta
(Mus musculus (mouse))
BDBM6149
(1,6-naphthyridine 18 | 3-tert-butyl-1-(7-{[3-(diet...)
Show SMILES CCN(CC)CCCNc1cc2nc(NC(=O)NC(C)(C)C)c(cc2cn1)-c1cc(OC)cc(OC)c1
Show InChI InChI=1S/C28H40N6O3/c1-8-34(9-2)12-10-11-29-25-17-24-20(18-30-25)15-23(19-13-21(36-6)16-22(14-19)37-7)26(31-24)32-27(35)33-28(3,4)5/h13-18H,8-12H2,1-7H3,(H,29,30)(H2,31,32,33,35)
n/an/a 1.80E+4n/an/an/an/a7.425
University of Auckland
Assay Description
Compounds were evaluated for their ability to prevent phosphorylation of a model glutamate-tyrosine copolymer substrate by isolated human FGFR-1, mou...
J Med Chem 48: 4628-53 (2005)
Article DOI: 10.1021/jm0500931
BindingDB Entry DOI: 10.7270/Q2DV1H3W
Vascular endothelial growth factor receptor 2
(Homo sapiens (Human))
BDBM6149
(1,6-naphthyridine 18 | 3-tert-butyl-1-(7-{[3-(diet...)
Show SMILES CCN(CC)CCCNc1cc2nc(NC(=O)NC(C)(C)C)c(cc2cn1)-c1cc(OC)cc(OC)c1
Show InChI InChI=1S/C28H40N6O3/c1-8-34(9-2)12-10-11-29-25-17-24-20(18-30-25)15-23(19-13-21(36-6)16-22(14-19)37-7)26(31-24)32-27(35)33-28(3,4)5/h13-18H,8-12H2,1-7H3,(H,29,30)(H2,31,32,33,35)
NCI pathway
Reactome pathway
n/an/a 15n/an/an/an/a7.822
University of Auckland
Assay Description
Tha assay was using human VEGFR-2 in DELFIA (dissociation-enhanced lanthanide fluoroimmunoassay) format. IC50 is the concentration of inhibitor that ...
J Med Chem 48: 4628-53 (2005)
Article DOI: 10.1021/jm0500931
BindingDB Entry DOI: 10.7270/Q2DV1H3W
Proto-oncogene tyrosine-protein kinase Src
(Homo sapiens (Human))
BDBM6149
(1,6-naphthyridine 18 | 3-tert-butyl-1-(7-{[3-(diet...)
Show SMILES CCN(CC)CCCNc1cc2nc(NC(=O)NC(C)(C)C)c(cc2cn1)-c1cc(OC)cc(OC)c1
Show InChI InChI=1S/C28H40N6O3/c1-8-34(9-2)12-10-11-29-25-17-24-20(18-30-25)15-23(19-13-21(36-6)16-22(14-19)37-7)26(31-24)32-27(35)33-28(3,4)5/h13-18H,8-12H2,1-7H3,(H,29,30)(H2,31,32,33,35)
n/an/a 1.60E+4n/an/an/an/a7.425
University of Auckland
Assay Description
Compounds were evaluated for their ability to prevent phosphorylation of a model glutamate-tyrosine copolymer substrate by isolated human FGFR-1, mou...
J Med Chem 48: 4628-53 (2005)
Article DOI: 10.1021/jm0500931
BindingDB Entry DOI: 10.7270/Q2DV1H3W
Fibroblast growth factor receptor 1
(Homo sapiens (Human))
BDBM6149
(1,6-naphthyridine 18 | 3-tert-butyl-1-(7-{[3-(diet...)
Show SMILES CCN(CC)CCCNc1cc2nc(NC(=O)NC(C)(C)C)c(cc2cn1)-c1cc(OC)cc(OC)c1
Show InChI InChI=1S/C28H40N6O3/c1-8-34(9-2)12-10-11-29-25-17-24-20(18-30-25)15-23(19-13-21(36-6)16-22(14-19)37-7)26(31-24)32-27(35)33-28(3,4)5/h13-18H,8-12H2,1-7H3,(H,29,30)(H2,31,32,33,35)
NCI pathway
Reactome pathway
n/an/a 60n/an/an/an/a7.425
University of Auckland
Assay Description
Compounds were evaluated for their ability to prevent phosphorylation of a model glutamate-tyrosine copolymer substrate by isolated human FGFR-1, mou...
J Med Chem 48: 4628-53 (2005)
Article DOI: 10.1021/jm0500931
BindingDB Entry DOI: 10.7270/Q2DV1H3W