null
SMILES: CCC(C)NS(=O)(=O)c1ccc(NC(=O)C(Sc2ccccc2)c2ccccc2)cc1
InChI Key: InChIKey=URECVAKCQOVBAK-UHFFFAOYSA-N
Activity Spreadsheet -- Enzyme Inhibition Constant Data from BindingDB
Found 1 hit for monomerid = 61492
Trg + Lig
Ki
nM
ΔG°
kcal/mole
IC50
nM
Kd
nM
EC50/IC50
nM
koff
s-1
kon
M-1s-1
pHTemp
°C
G-protein coupled receptor 55
(Homo sapiens (Human))
BDBM61492
(2-phenyl-2-(phenylthio)-N-[4-(sec-butylsulfamoyl)p...)
Show SMILES CCC(C)NS(=O)(=O)c1ccc(NC(=O)C(Sc2ccccc2)c2ccccc2)cc1
Show InChI InChI=1S/C24H26N2O3S2/c1-3-18(2)26-31(28,29)22-16-14-20(15-17-22)25-24(27)23(19-10-6-4-7-11-19)30-21-12-8-5-9-13-21/h4-18,23,26H,3H2,1-2H3,(H,25,27)
Reactome pathway
PCBioAssay
n/an/a 592n/an/an/an/an/an/a
Burnham Center for Chemical Genomics
Curated by PubChem BioAssay
Assay Description
Data Source: Sanford-Burnham Center for Chemical Genomics (SBCCG) Source Affiliation: Sanford-Burnham Medical Research Institute (SBMRI, San Diego, C...
PubChem Bioassay (2010)
BindingDB Entry DOI: 10.7270/Q2348HSG