null
SMILES: CC(NC(=O)C(=C\c1ccc(Cl)c(c1)[N+]([O-])=O)\C#N)c1ccccc1
InChI Key: InChIKey=KIZGUZNDUXESAE-OQLLNIDSSA-N
Activity Spreadsheet -- Enzyme Inhibition Constant Data from BindingDB
Found 7 hits for monomerid = 61511
Trg + Lig
Ki
nM
ΔG°
kcal/mole
IC50
nM
Kd
nM
EC50/IC50
nM
koff
s-1
kon
M-1s-1
pHTemp
°C
G-protein coupled receptor 55
(Homo sapiens (Human))
BDBM61511
((E)-3-(4-chloranyl-3-nitro-phenyl)-2-cyano-N-(1-ph...)
Show SMILES CC(NC(=O)C(=C\c1ccc(Cl)c(c1)[N+]([O-])=O)\C#N)c1ccccc1
Show InChI InChI=1S/C18H14ClN3O3/c1-12(14-5-3-2-4-6-14)21-18(23)15(11-20)9-13-7-8-16(19)17(10-13)22(24)25/h2-10,12H,1H3,(H,21,23)/b15-9+
Reactome pathway
PCBioAssay
n/an/a 8.95E+3n/an/an/an/an/an/a
Burnham Center for Chemical Genomics
Curated by PubChem BioAssay
Assay Description
Data Source: Sanford-Burnham Center for Chemical Genomics (SBCCG) Source Affiliation: Sanford-Burnham Medical Research Institute (SBMRI, San Diego, C...
PubChem Bioassay (2010)
BindingDB Entry DOI: 10.7270/Q2348HSG
G-protein coupled receptor 35
(Homo sapiens (Human))
BDBM61511
((E)-3-(4-chloranyl-3-nitro-phenyl)-2-cyano-N-(1-ph...)
Show SMILES CC(NC(=O)C(=C\c1ccc(Cl)c(c1)[N+]([O-])=O)\C#N)c1ccccc1
Show InChI InChI=1S/C18H14ClN3O3/c1-12(14-5-3-2-4-6-14)21-18(23)15(11-20)9-13-7-8-16(19)17(10-13)22(24)25/h2-10,12H,1H3,(H,21,23)/b15-9+
PCBioAssay
n/an/a 2.53E+3n/an/an/an/an/an/a
Burnham Center for Chemical Genomics
Curated by PubChem BioAssay
Assay Description
Data Source: Sanford-Burnham Center for Chemical Genomics (SBCCG) Source Affiliation: Sanford-Burnham Medical Research Institute (SBMRI, San Diego, C...
PubChem Bioassay (2010)
BindingDB Entry DOI: 10.7270/Q2TQ5ZZB
DNA damage-inducible transcript 3 protein
(Mus musculus)
BDBM61511
((E)-3-(4-chloranyl-3-nitro-phenyl)-2-cyano-N-(1-ph...)
Show SMILES CC(NC(=O)C(=C\c1ccc(Cl)c(c1)[N+]([O-])=O)\C#N)c1ccccc1
Show InChI InChI=1S/C18H14ClN3O3/c1-12(14-5-3-2-4-6-14)21-18(23)15(11-20)9-13-7-8-16(19)17(10-13)22(24)25/h2-10,12H,1H3,(H,21,23)/b15-9+
PCBioAssay
n/an/a>1.00E+4n/an/an/an/an/an/a
Emory University Molecular Libraries Screening Center
Curated by PubChem BioAssay
Assay Description
NIH Molecular Libraries Screening Centers Network [MLSCN] Emory Chemical Biology Discovery Center in MLSCN Assay provider: Dr. Randal Kaufman, Univer...
PubChem Bioassay (2010)
BindingDB Entry DOI: 10.7270/Q2PC30VZ
DNA damage-inducible transcript 3 protein
(Mus musculus)
BDBM61511
((E)-3-(4-chloranyl-3-nitro-phenyl)-2-cyano-N-(1-ph...)
Show SMILES CC(NC(=O)C(=C\c1ccc(Cl)c(c1)[N+]([O-])=O)\C#N)c1ccccc1
Show InChI InChI=1S/C18H14ClN3O3/c1-12(14-5-3-2-4-6-14)21-18(23)15(11-20)9-13-7-8-16(19)17(10-13)22(24)25/h2-10,12H,1H3,(H,21,23)/b15-9+
PCBioAssay
n/an/a>1.00E+4n/an/an/an/an/an/a
Emory University Molecular Libraries Screening Center
Curated by PubChem BioAssay
Assay Description
NIH Molecular Libraries Screening Centers Network [MLSCN] Emory Chemical Biology Discovery Center in MLSCN Assay provider: Dr. Randal Kaufman, Univer...
PubChem Bioassay (2011)
BindingDB Entry DOI: 10.7270/Q28C9TQN
Integrin alpha-4
(Homo sapiens (Human))
BDBM61511
((E)-3-(4-chloranyl-3-nitro-phenyl)-2-cyano-N-(1-ph...)
Show SMILES CC(NC(=O)C(=C\c1ccc(Cl)c(c1)[N+]([O-])=O)\C#N)c1ccccc1
Show InChI InChI=1S/C18H14ClN3O3/c1-12(14-5-3-2-4-6-14)21-18(23)15(11-20)9-13-7-8-16(19)17(10-13)22(24)25/h2-10,12H,1H3,(H,21,23)/b15-9+
PCBioAssay
n/an/an/an/a 2.43E+3n/an/an/an/a
NMMLSC
Curated by PubChem BioAssay
Assay Description
University of New Mexico Assay Overview: Assay Support: 1 R01 HL081062-01 Project Title: HTS for Identification of VLA-4 Allosteric Modulators (ML...
PubChem Bioassay (2010)
BindingDB Entry DOI: 10.7270/Q24X5684
X-box-binding protein 1
(Homo sapiens (Human))
BDBM61511
((E)-3-(4-chloranyl-3-nitro-phenyl)-2-cyano-N-(1-ph...)
Show SMILES CC(NC(=O)C(=C\c1ccc(Cl)c(c1)[N+]([O-])=O)\C#N)c1ccccc1
Show InChI InChI=1S/C18H14ClN3O3/c1-12(14-5-3-2-4-6-14)21-18(23)15(11-20)9-13-7-8-16(19)17(10-13)22(24)25/h2-10,12H,1H3,(H,21,23)/b15-9+
PCBioAssay
n/an/a 1.00E+4n/an/an/an/an/an/a
Emory University Molecular Libraries Screening Center
Curated by PubChem BioAssay
Assay Description
NIH Molecular Libraries Screening Centers Network [MLSCN] Emory Chemical Biology Discovery Center in MLSCN Assay provider: Dr. Randal Kaufman, Univer...
PubChem Bioassay (2011)
BindingDB Entry DOI: 10.7270/Q2NK3CGB
Integrin alpha-4
(Homo sapiens (Human))
BDBM61511
((E)-3-(4-chloranyl-3-nitro-phenyl)-2-cyano-N-(1-ph...)
Show SMILES CC(NC(=O)C(=C\c1ccc(Cl)c(c1)[N+]([O-])=O)\C#N)c1ccccc1
Show InChI InChI=1S/C18H14ClN3O3/c1-12(14-5-3-2-4-6-14)21-18(23)15(11-20)9-13-7-8-16(19)17(10-13)22(24)25/h2-10,12H,1H3,(H,21,23)/b15-9+
PCBioAssay
n/an/an/an/a 950n/an/an/an/a
NMMLSC
Curated by PubChem BioAssay
Assay Description
University of New Mexico Assay Overview: Assay Support Project Title:HTS for Identification of VLA-4 Allosteric Modulators 1 R01 HL081062-01 PI:Lar...
PubChem Bioassay (2010)
BindingDB Entry DOI: 10.7270/Q2ZG6QP2