null
SMILES: CCN(CC)CCCCNc1cc2nc(NC(=O)NC(C)(C)C)c(cc2cn1)-c1cc(OC)cc(OC)c1
InChI Key: InChIKey=YMKCMNJQFGEWCA-UHFFFAOYSA-N
Activity Spreadsheet -- Enzyme Inhibition Constant Data from BindingDB
Found 4 hits for monomerid = 6154
Trg + Lig
Ki
nM
ΔG°
kcal/mole
IC50
nM
Kd
nM
EC50/IC50
nM
koff
s-1
kon
M-1s-1
pHTemp
°C
Platelet-derived growth factor receptor beta
(Mus musculus (mouse))
BDBM6154
(1,6-naphthyridine 23 | 3-tert-butyl-1-(7-{[4-(diet...)
Show SMILES CCN(CC)CCCCNc1cc2nc(NC(=O)NC(C)(C)C)c(cc2cn1)-c1cc(OC)cc(OC)c1
Show InChI InChI=1S/C29H42N6O3/c1-8-35(9-2)13-11-10-12-30-26-18-25-21(19-31-26)16-24(20-14-22(37-6)17-23(15-20)38-7)27(32-25)33-28(36)34-29(3,4)5/h14-19H,8-13H2,1-7H3,(H,30,31)(H2,32,33,34,36)
n/an/a 2.60E+3n/an/an/an/an/an/a
University of Auckland
Assay Description
Compounds were evaluated for their ability to prevent phosphorylation of a model glutamate-tyrosine copolymer substrate by isolated human FGFR-1, mou...
J Med Chem 48: 4628-53 (2005)
Article DOI: 10.1021/jm0500931
BindingDB Entry DOI: 10.7270/Q2DV1H3W
Vascular endothelial growth factor receptor 2
(Homo sapiens (Human))
BDBM6154
(1,6-naphthyridine 23 | 3-tert-butyl-1-(7-{[4-(diet...)
Show SMILES CCN(CC)CCCCNc1cc2nc(NC(=O)NC(C)(C)C)c(cc2cn1)-c1cc(OC)cc(OC)c1
Show InChI InChI=1S/C29H42N6O3/c1-8-35(9-2)13-11-10-12-30-26-18-25-21(19-31-26)16-24(20-14-22(37-6)17-23(15-20)38-7)27(32-25)33-28(36)34-29(3,4)5/h14-19H,8-13H2,1-7H3,(H,30,31)(H2,32,33,34,36)
NCI pathway
Reactome pathway
n/an/a 6n/an/an/an/an/an/a
University of Auckland
Assay Description
Tha assay was using human VEGFR-2 in DELFIA (dissociation-enhanced lanthanide fluoroimmunoassay) format. IC50 is the concentration of inhibitor that ...
J Med Chem 48: 4628-53 (2005)
Article DOI: 10.1021/jm0500931
BindingDB Entry DOI: 10.7270/Q2DV1H3W
Proto-oncogene tyrosine-protein kinase Src
(Homo sapiens (Human))
BDBM6154
(1,6-naphthyridine 23 | 3-tert-butyl-1-(7-{[4-(diet...)
Show SMILES CCN(CC)CCCCNc1cc2nc(NC(=O)NC(C)(C)C)c(cc2cn1)-c1cc(OC)cc(OC)c1
Show InChI InChI=1S/C29H42N6O3/c1-8-35(9-2)13-11-10-12-30-26-18-25-21(19-31-26)16-24(20-14-22(37-6)17-23(15-20)38-7)27(32-25)33-28(36)34-29(3,4)5/h14-19H,8-13H2,1-7H3,(H,30,31)(H2,32,33,34,36)
n/an/a 4.60E+3n/an/an/an/an/an/a
University of Auckland
Assay Description
Compounds were evaluated for their ability to prevent phosphorylation of a model glutamate-tyrosine copolymer substrate by isolated human FGFR-1, mou...
J Med Chem 48: 4628-53 (2005)
Article DOI: 10.1021/jm0500931
BindingDB Entry DOI: 10.7270/Q2DV1H3W
Fibroblast growth factor receptor 1
(Homo sapiens (Human))
BDBM6154
(1,6-naphthyridine 23 | 3-tert-butyl-1-(7-{[4-(diet...)
Show SMILES CCN(CC)CCCCNc1cc2nc(NC(=O)NC(C)(C)C)c(cc2cn1)-c1cc(OC)cc(OC)c1
Show InChI InChI=1S/C29H42N6O3/c1-8-35(9-2)13-11-10-12-30-26-18-25-21(19-31-26)16-24(20-14-22(37-6)17-23(15-20)38-7)27(32-25)33-28(36)34-29(3,4)5/h14-19H,8-13H2,1-7H3,(H,30,31)(H2,32,33,34,36)
NCI pathway
Reactome pathway
n/an/a 25n/an/an/an/an/an/a
University of Auckland
Assay Description
Compounds were evaluated for their ability to prevent phosphorylation of a model glutamate-tyrosine copolymer substrate by isolated human FGFR-1, mou...
J Med Chem 48: 4628-53 (2005)
Article DOI: 10.1021/jm0500931
BindingDB Entry DOI: 10.7270/Q2DV1H3W