null
SMILES: COc1cc(OC)cc(c1)-c1cc2cnc(NCCCCCN3CCN(C)CC3)cc2nc1NC(=O)NC(C)(C)C
InChI Key: InChIKey=LUPSYDSJDYGOGY-UHFFFAOYSA-N
Activity Spreadsheet -- Enzyme Inhibition Constant Data from BindingDB
Found 4 hits for monomerid = 6156
Trg + Lig
Ki
nM
ΔG°
kcal/mole
IC50
nM
Kd
nM
EC50/IC50
nM
koff
s-1
kon
M-1s-1
pHTemp
°C
Platelet-derived growth factor receptor beta
(Mus musculus (mouse))
BDBM6156
(1,6-naphthyridine 25 | 3-tert-butyl-1-[3-(3,5-dime...)
Show SMILES COc1cc(OC)cc(c1)-c1cc2cnc(NCCCCCN3CCN(C)CC3)cc2nc1NC(=O)NC(C)(C)C
Show InChI InChI=1S/C31H45N7O3/c1-31(2,3)36-30(39)35-29-26(22-16-24(40-5)19-25(17-22)41-6)18-23-21-33-28(20-27(23)34-29)32-10-8-7-9-11-38-14-12-37(4)13-15-38/h16-21H,7-15H2,1-6H3,(H,32,33)(H2,34,35,36,39)
n/an/a 2.70E+4n/an/an/an/an/an/a
University of Auckland
Assay Description
Compounds were evaluated for their ability to prevent phosphorylation of a model glutamate-tyrosine copolymer substrate by isolated human FGFR-1, mou...
J Med Chem 48: 4628-53 (2005)
Article DOI: 10.1021/jm0500931
BindingDB Entry DOI: 10.7270/Q2DV1H3W
Vascular endothelial growth factor receptor 2
(Homo sapiens (Human))
BDBM6156
(1,6-naphthyridine 25 | 3-tert-butyl-1-[3-(3,5-dime...)
Show SMILES COc1cc(OC)cc(c1)-c1cc2cnc(NCCCCCN3CCN(C)CC3)cc2nc1NC(=O)NC(C)(C)C
Show InChI InChI=1S/C31H45N7O3/c1-31(2,3)36-30(39)35-29-26(22-16-24(40-5)19-25(17-22)41-6)18-23-21-33-28(20-27(23)34-29)32-10-8-7-9-11-38-14-12-37(4)13-15-38/h16-21H,7-15H2,1-6H3,(H,32,33)(H2,34,35,36,39)
NCI pathway
Reactome pathway
n/an/a 8n/an/an/an/an/an/a
University of Auckland
Assay Description
Tha assay was using human VEGFR-2 in DELFIA (dissociation-enhanced lanthanide fluoroimmunoassay) format. IC50 is the concentration of inhibitor that ...
J Med Chem 48: 4628-53 (2005)
Article DOI: 10.1021/jm0500931
BindingDB Entry DOI: 10.7270/Q2DV1H3W
Proto-oncogene tyrosine-protein kinase Src
(Homo sapiens (Human))
BDBM6156
(1,6-naphthyridine 25 | 3-tert-butyl-1-[3-(3,5-dime...)
Show SMILES COc1cc(OC)cc(c1)-c1cc2cnc(NCCCCCN3CCN(C)CC3)cc2nc1NC(=O)NC(C)(C)C
Show InChI InChI=1S/C31H45N7O3/c1-31(2,3)36-30(39)35-29-26(22-16-24(40-5)19-25(17-22)41-6)18-23-21-33-28(20-27(23)34-29)32-10-8-7-9-11-38-14-12-37(4)13-15-38/h16-21H,7-15H2,1-6H3,(H,32,33)(H2,34,35,36,39)
n/an/a 6.10E+3n/an/an/an/an/an/a
University of Auckland
Assay Description
Compounds were evaluated for their ability to prevent phosphorylation of a model glutamate-tyrosine copolymer substrate by isolated human FGFR-1, mou...
J Med Chem 48: 4628-53 (2005)
Article DOI: 10.1021/jm0500931
BindingDB Entry DOI: 10.7270/Q2DV1H3W
Fibroblast growth factor receptor 1
(Homo sapiens (Human))
BDBM6156
(1,6-naphthyridine 25 | 3-tert-butyl-1-[3-(3,5-dime...)
Show SMILES COc1cc(OC)cc(c1)-c1cc2cnc(NCCCCCN3CCN(C)CC3)cc2nc1NC(=O)NC(C)(C)C
Show InChI InChI=1S/C31H45N7O3/c1-31(2,3)36-30(39)35-29-26(22-16-24(40-5)19-25(17-22)41-6)18-23-21-33-28(20-27(23)34-29)32-10-8-7-9-11-38-14-12-37(4)13-15-38/h16-21H,7-15H2,1-6H3,(H,32,33)(H2,34,35,36,39)
NCI pathway
Reactome pathway
n/an/a 70n/an/an/an/an/an/a
University of Auckland
Assay Description
Compounds were evaluated for their ability to prevent phosphorylation of a model glutamate-tyrosine copolymer substrate by isolated human FGFR-1, mou...
J Med Chem 48: 4628-53 (2005)
Article DOI: 10.1021/jm0500931
BindingDB Entry DOI: 10.7270/Q2DV1H3W