BDBM61684 1-(2,3-dichlorophenyl)-3-(4,6-dimethyl-2-pyridinyl)thiourea::1-(2,3-dichlorophenyl)-3-(4,6-dimethyl-2-pyridyl)thiourea::1-(2,3-dichlorophenyl)-3-(4,6-dimethylpyridin-2-yl)thiourea::1-[2,3-bis(chloranyl)phenyl]-3-(4,6-dimethylpyridin-2-yl)thiourea::MLS000666418::N-(2,3-dichlorophenyl)-N'-(4,6-dimethyl-2-pyridinyl)thiourea::SMR000294246::cid_970728
SMILES: Cc1cc(C)nc(NC(=S)Nc2cccc(Cl)c2Cl)c1
InChI Key: InChIKey=VZRYKCRWZWKBKS-UHFFFAOYSA-N
Data: 1 IC50
Activity Spreadsheet -- Enzyme Inhibition Constant Data from BindingDB
Found 1 hit for monomerid = 61684
Trg + Lig
Ki
nM
ΔG°
kcal/mole
IC50
nM
Kd
nM
EC50/IC50
nM
koff
s-1
kon
M-1s-1
pHTemp
°C
Voltage-gated calcium channel subunit alpha Cav2.2
(Homo sapiens (Human))
BDBM61684
(1-(2,3-dichlorophenyl)-3-(4,6-dimethyl-2-pyridinyl...)
Show SMILES Cc1cc(C)nc(NC(=S)Nc2cccc(Cl)c2Cl)c1
Show InChI InChI=1S/C14H13Cl2N3S/c1-8-6-9(2)17-12(7-8)19-14(20)18-11-5-3-4-10(15)13(11)16/h3-7H,1-2H3,(H2,17,18,19,20)
PCBioAssay
n/an/a 1.27E+3n/an/an/an/an/an/a
Burnham Center for Chemical Genomics
Curated by PubChem BioAssay
Assay Description
Data Source: Data Source: Sanford-Burnham Center for Chemical Genomics (SBCCG) Source Affiliation: Sanford-Burnham Medical Research Institute Network...
PubChem Bioassay (2009)
BindingDB Entry DOI: 10.7270/Q2PZ578V