BDBM6170 1,6-naphthyridine 39::N-[4-(Benzyloxy)butyl]-N-[2-[[(tert-butylamino)carbonyl]amino]-3-(3,5-dimethoxyphenyl)-1,6-naphthyridin-7-yl]acetamide::N-[4-(benzyloxy)butyl]-N-{2-[(tert-butylcarbamoyl)amino]-3-(3,5-dimethoxyphenyl)-1,6-naphthyridin-7-yl}acetamide
SMILES: COc1cc(OC)cc(c1)-c1cc2cnc(cc2nc1NC(=O)NC(C)(C)C)N(CCCCOCc1ccccc1)C(C)=O
InChI Key: InChIKey=DPDLEGYGVYOUSQ-UHFFFAOYSA-N
Data: 4 IC50
Activity Spreadsheet -- Enzyme Inhibition Constant Data from BindingDB
Found 4 hits for monomerid = 6170
Trg + Lig
Ki
nM
ΔG°
kcal/mole
IC50
nM
Kd
nM
EC50/IC50
nM
koff
s-1
kon
M-1s-1
pHTemp
°C
Platelet-derived growth factor receptor beta
(Mus musculus (mouse))
BDBM6170
(1,6-naphthyridine 39 | N-[4-(Benzyloxy)butyl]-N-[2...)
Show SMILES COc1cc(OC)cc(c1)-c1cc2cnc(cc2nc1NC(=O)NC(C)(C)C)N(CCCCOCc1ccccc1)C(C)=O
Show InChI InChI=1S/C34H41N5O5/c1-23(40)39(14-10-11-15-44-22-24-12-8-7-9-13-24)31-20-30-26(21-35-31)18-29(25-16-27(42-5)19-28(17-25)43-6)32(36-30)37-33(41)38-34(2,3)4/h7-9,12-13,16-21H,10-11,14-15,22H2,1-6H3,(H2,36,37,38,41)
n/an/a>5.00E+4n/an/an/an/an/an/a
University of Auckland
Assay Description
Compounds were evaluated for their ability to prevent phosphorylation of a model glutamate-tyrosine copolymer substrate by isolated human FGFR-1, mou...
J Med Chem 48: 4628-53 (2005)
Article DOI: 10.1021/jm0500931
BindingDB Entry DOI: 10.7270/Q2DV1H3W
Vascular endothelial growth factor receptor 2
(Homo sapiens (Human))
BDBM6170
(1,6-naphthyridine 39 | N-[4-(Benzyloxy)butyl]-N-[2...)
Show SMILES COc1cc(OC)cc(c1)-c1cc2cnc(cc2nc1NC(=O)NC(C)(C)C)N(CCCCOCc1ccccc1)C(C)=O
Show InChI InChI=1S/C34H41N5O5/c1-23(40)39(14-10-11-15-44-22-24-12-8-7-9-13-24)31-20-30-26(21-35-31)18-29(25-16-27(42-5)19-28(17-25)43-6)32(36-30)37-33(41)38-34(2,3)4/h7-9,12-13,16-21H,10-11,14-15,22H2,1-6H3,(H2,36,37,38,41)
NCI pathway
Reactome pathway
n/an/a 670n/an/an/an/an/an/a
University of Auckland
Assay Description
Tha assay was using human VEGFR-2 in DELFIA (dissociation-enhanced lanthanide fluoroimmunoassay) format. IC50 is the concentration of inhibitor that ...
J Med Chem 48: 4628-53 (2005)
Article DOI: 10.1021/jm0500931
BindingDB Entry DOI: 10.7270/Q2DV1H3W
Proto-oncogene tyrosine-protein kinase Src
(Homo sapiens (Human))
BDBM6170
(1,6-naphthyridine 39 | N-[4-(Benzyloxy)butyl]-N-[2...)
Show SMILES COc1cc(OC)cc(c1)-c1cc2cnc(cc2nc1NC(=O)NC(C)(C)C)N(CCCCOCc1ccccc1)C(C)=O
Show InChI InChI=1S/C34H41N5O5/c1-23(40)39(14-10-11-15-44-22-24-12-8-7-9-13-24)31-20-30-26(21-35-31)18-29(25-16-27(42-5)19-28(17-25)43-6)32(36-30)37-33(41)38-34(2,3)4/h7-9,12-13,16-21H,10-11,14-15,22H2,1-6H3,(H2,36,37,38,41)
n/an/a>5.00E+4n/an/an/an/an/an/a
University of Auckland
Assay Description
Compounds were evaluated for their ability to prevent phosphorylation of a model glutamate-tyrosine copolymer substrate by isolated human FGFR-1, mou...
J Med Chem 48: 4628-53 (2005)
Article DOI: 10.1021/jm0500931
BindingDB Entry DOI: 10.7270/Q2DV1H3W
Fibroblast growth factor receptor 1
(Homo sapiens (Human))
BDBM6170
(1,6-naphthyridine 39 | N-[4-(Benzyloxy)butyl]-N-[2...)
Show SMILES COc1cc(OC)cc(c1)-c1cc2cnc(cc2nc1NC(=O)NC(C)(C)C)N(CCCCOCc1ccccc1)C(C)=O
Show InChI InChI=1S/C34H41N5O5/c1-23(40)39(14-10-11-15-44-22-24-12-8-7-9-13-24)31-20-30-26(21-35-31)18-29(25-16-27(42-5)19-28(17-25)43-6)32(36-30)37-33(41)38-34(2,3)4/h7-9,12-13,16-21H,10-11,14-15,22H2,1-6H3,(H2,36,37,38,41)
NCI pathway
Reactome pathway
n/an/a 5.10E+3n/an/an/an/an/an/a
University of Auckland
Assay Description
Compounds were evaluated for their ability to prevent phosphorylation of a model glutamate-tyrosine copolymer substrate by isolated human FGFR-1, mou...
J Med Chem 48: 4628-53 (2005)
Article DOI: 10.1021/jm0500931
BindingDB Entry DOI: 10.7270/Q2DV1H3W