BDBM6172 1,6-naphthyridine 44::N-[2-[[(tert-Butylamino)carbonyl]amino]-3-(3,5-dimethoxyphenyl)-1,6-naphthyridin-7-yl]-N-(3-hydroxypropyl)acetamide::N-{2-[(tert-butylcarbamoyl)amino]-3-(3,5-dimethoxyphenyl)-1,6-naphthyridin-7-yl}-N-(3-hydroxypropyl)acetamide
SMILES: COc1cc(OC)cc(c1)-c1cc2cnc(cc2nc1NC(=O)NC(C)(C)C)N(CCCO)C(C)=O
InChI Key: InChIKey=AAIWEHICLXWDIS-UHFFFAOYSA-N
Data: 4 IC50
Activity Spreadsheet -- Enzyme Inhibition Constant Data from BindingDB
Found 4 hits for monomerid = 6172
Trg + Lig
Ki
nM
ΔG°
kcal/mole
IC50
nM
Kd
nM
EC50/IC50
nM
koff
s-1
kon
M-1s-1
pHTemp
°C
Platelet-derived growth factor receptor beta
(Mus musculus (mouse))
BDBM6172
(1,6-naphthyridine 44 | N-[2-[[(tert-Butylamino)car...)
Show SMILES COc1cc(OC)cc(c1)-c1cc2cnc(cc2nc1NC(=O)NC(C)(C)C)N(CCCO)C(C)=O
Show InChI InChI=1S/C26H33N5O5/c1-16(33)31(8-7-9-32)23-14-22-18(15-27-23)12-21(17-10-19(35-5)13-20(11-17)36-6)24(28-22)29-25(34)30-26(2,3)4/h10-15,32H,7-9H2,1-6H3,(H2,28,29,30,34)
n/an/a>5.00E+4n/an/an/an/an/an/a
University of Auckland
Assay Description
Compounds were evaluated for their ability to prevent phosphorylation of a model glutamate-tyrosine copolymer substrate by isolated human FGFR-1, mou...
J Med Chem 48: 4628-53 (2005)
Article DOI: 10.1021/jm0500931
BindingDB Entry DOI: 10.7270/Q2DV1H3W
Vascular endothelial growth factor receptor 2
(Homo sapiens (Human))
BDBM6172
(1,6-naphthyridine 44 | N-[2-[[(tert-Butylamino)car...)
Show SMILES COc1cc(OC)cc(c1)-c1cc2cnc(cc2nc1NC(=O)NC(C)(C)C)N(CCCO)C(C)=O
Show InChI InChI=1S/C26H33N5O5/c1-16(33)31(8-7-9-32)23-14-22-18(15-27-23)12-21(17-10-19(35-5)13-20(11-17)36-6)24(28-22)29-25(34)30-26(2,3)4/h10-15,32H,7-9H2,1-6H3,(H2,28,29,30,34)
NCI pathway
Reactome pathway
n/an/a 1.90E+3n/an/an/an/an/an/a
University of Auckland
Assay Description
Tha assay was using human VEGFR-2 in DELFIA (dissociation-enhanced lanthanide fluoroimmunoassay) format. IC50 is the concentration of inhibitor that ...
J Med Chem 48: 4628-53 (2005)
Article DOI: 10.1021/jm0500931
BindingDB Entry DOI: 10.7270/Q2DV1H3W
Proto-oncogene tyrosine-protein kinase Src
(Homo sapiens (Human))
BDBM6172
(1,6-naphthyridine 44 | N-[2-[[(tert-Butylamino)car...)
Show SMILES COc1cc(OC)cc(c1)-c1cc2cnc(cc2nc1NC(=O)NC(C)(C)C)N(CCCO)C(C)=O
Show InChI InChI=1S/C26H33N5O5/c1-16(33)31(8-7-9-32)23-14-22-18(15-27-23)12-21(17-10-19(35-5)13-20(11-17)36-6)24(28-22)29-25(34)30-26(2,3)4/h10-15,32H,7-9H2,1-6H3,(H2,28,29,30,34)
n/an/a>5.00E+4n/an/an/an/an/an/a
University of Auckland
Assay Description
Compounds were evaluated for their ability to prevent phosphorylation of a model glutamate-tyrosine copolymer substrate by isolated human FGFR-1, mou...
J Med Chem 48: 4628-53 (2005)
Article DOI: 10.1021/jm0500931
BindingDB Entry DOI: 10.7270/Q2DV1H3W
Fibroblast growth factor receptor 1
(Homo sapiens (Human))
BDBM6172
(1,6-naphthyridine 44 | N-[2-[[(tert-Butylamino)car...)
Show SMILES COc1cc(OC)cc(c1)-c1cc2cnc(cc2nc1NC(=O)NC(C)(C)C)N(CCCO)C(C)=O
Show InChI InChI=1S/C26H33N5O5/c1-16(33)31(8-7-9-32)23-14-22-18(15-27-23)12-21(17-10-19(35-5)13-20(11-17)36-6)24(28-22)29-25(34)30-26(2,3)4/h10-15,32H,7-9H2,1-6H3,(H2,28,29,30,34)
NCI pathway
Reactome pathway
n/an/a 2.80E+4n/an/an/an/an/an/a
University of Auckland
Assay Description
Compounds were evaluated for their ability to prevent phosphorylation of a model glutamate-tyrosine copolymer substrate by isolated human FGFR-1, mou...
J Med Chem 48: 4628-53 (2005)
Article DOI: 10.1021/jm0500931
BindingDB Entry DOI: 10.7270/Q2DV1H3W