null
SMILES: COc1cc(OC)cc(c1)C1Cc2cnc(cc2N=C1NC(=O)NC(C)(C)C)N(CCCCO)C(C)=O
InChI Key: InChIKey=XCNNRVIIVZONIG-UHFFFAOYSA-N
Activity Spreadsheet -- Enzyme Inhibition Constant Data from BindingDB
Found 4 hits for monomerid = 6185
Trg + Lig
Ki
nM
ΔG°
kcal/mole
IC50
nM
Kd
nM
EC50/IC50
nM
koff
s-1
kon
M-1s-1
pHTemp
°C
Platelet-derived growth factor receptor beta
(Mus musculus (mouse))
BDBM6185
(3,4-Dihydro-1,6-naphthyridine analogue 52 | N-[2-[...)
Show SMILES COc1cc(OC)cc(c1)C1Cc2cnc(cc2N=C1NC(=O)NC(C)(C)C)N(CCCCO)C(C)=O |c:20|
Show InChI InChI=1S/C27H37N5O5/c1-17(34)32(9-7-8-10-33)24-15-23-19(16-28-24)13-22(18-11-20(36-5)14-21(12-18)37-6)25(29-23)30-26(35)31-27(2,3)4/h11-12,14-16,22,33H,7-10,13H2,1-6H3,(H2,29,30,31,35)
n/an/a>5.00E+4n/an/an/an/an/an/a
University of Auckland
Assay Description
Compounds were evaluated for their ability to prevent phosphorylation of a model glutamate-tyrosine copolymer substrate by isolated human FGFR-1, mou...
J Med Chem 48: 4628-53 (2005)
Article DOI: 10.1021/jm0500931
BindingDB Entry DOI: 10.7270/Q2DV1H3W
Vascular endothelial growth factor receptor 2
(Homo sapiens (Human))
BDBM6185
(3,4-Dihydro-1,6-naphthyridine analogue 52 | N-[2-[...)
Show SMILES COc1cc(OC)cc(c1)C1Cc2cnc(cc2N=C1NC(=O)NC(C)(C)C)N(CCCCO)C(C)=O |c:20|
Show InChI InChI=1S/C27H37N5O5/c1-17(34)32(9-7-8-10-33)24-15-23-19(16-28-24)13-22(18-11-20(36-5)14-21(12-18)37-6)25(29-23)30-26(35)31-27(2,3)4/h11-12,14-16,22,33H,7-10,13H2,1-6H3,(H2,29,30,31,35)
NCI pathway
Reactome pathway
n/an/a 1.00E+4n/an/an/an/an/an/a
University of Auckland
Assay Description
Tha assay was using human VEGFR-2 in DELFIA (dissociation-enhanced lanthanide fluoroimmunoassay) format. IC50 is the concentration of inhibitor that ...
J Med Chem 48: 4628-53 (2005)
Article DOI: 10.1021/jm0500931
BindingDB Entry DOI: 10.7270/Q2DV1H3W
Proto-oncogene tyrosine-protein kinase Src
(Homo sapiens (Human))
BDBM6185
(3,4-Dihydro-1,6-naphthyridine analogue 52 | N-[2-[...)
Show SMILES COc1cc(OC)cc(c1)C1Cc2cnc(cc2N=C1NC(=O)NC(C)(C)C)N(CCCCO)C(C)=O |c:20|
Show InChI InChI=1S/C27H37N5O5/c1-17(34)32(9-7-8-10-33)24-15-23-19(16-28-24)13-22(18-11-20(36-5)14-21(12-18)37-6)25(29-23)30-26(35)31-27(2,3)4/h11-12,14-16,22,33H,7-10,13H2,1-6H3,(H2,29,30,31,35)
n/an/a>5.00E+4n/an/an/an/an/an/a
University of Auckland
Assay Description
Compounds were evaluated for their ability to prevent phosphorylation of a model glutamate-tyrosine copolymer substrate by isolated human FGFR-1, mou...
J Med Chem 48: 4628-53 (2005)
Article DOI: 10.1021/jm0500931
BindingDB Entry DOI: 10.7270/Q2DV1H3W
Fibroblast growth factor receptor 1
(Homo sapiens (Human))
BDBM6185
(3,4-Dihydro-1,6-naphthyridine analogue 52 | N-[2-[...)
Show SMILES COc1cc(OC)cc(c1)C1Cc2cnc(cc2N=C1NC(=O)NC(C)(C)C)N(CCCCO)C(C)=O |c:20|
Show InChI InChI=1S/C27H37N5O5/c1-17(34)32(9-7-8-10-33)24-15-23-19(16-28-24)13-22(18-11-20(36-5)14-21(12-18)37-6)25(29-23)30-26(35)31-27(2,3)4/h11-12,14-16,22,33H,7-10,13H2,1-6H3,(H2,29,30,31,35)
NCI pathway
Reactome pathway
n/an/a>5.00E+4n/an/an/an/an/an/a
University of Auckland
Assay Description
Compounds were evaluated for their ability to prevent phosphorylation of a model glutamate-tyrosine copolymer substrate by isolated human FGFR-1, mou...
J Med Chem 48: 4628-53 (2005)
Article DOI: 10.1021/jm0500931
BindingDB Entry DOI: 10.7270/Q2DV1H3W