BDBM62340 MLS-0425706.0001::N-[(4S)-1-(2-fluorophenyl)-4,5,6,7-tetrahydroindazol-4-yl]-2-methyl-3-pyrazolecarboxamide::N-[(4S)-1-(2-fluorophenyl)-4,5,6,7-tetrahydroindazol-4-yl]-2-methyl-pyrazole-3-carboxamide::N-[(4S)-1-(2-fluorophenyl)-4,5,6,7-tetrahydroindazol-4-yl]-2-methylpyrazole-3-carboxamide::cid_42191617
SMILES: Cn1nccc1C(=O)N[C@H]1CCCc2c1cnn2-c1ccccc1F
InChI Key: InChIKey=ZFXSRSREUVYGOD-AWEZNQCLSA-N
Data: 3 IC50
Activity Spreadsheet -- Enzyme Inhibition Constant Data from BindingDB
Found 3 hits for monomerid = 62340
Trg + Lig
Ki
nM
ΔG°
kcal/mole
IC50
nM
Kd
nM
EC50/IC50
nM
koff
s-1
kon
M-1s-1
pHTemp
°C
nucleotide-binding oligomerization domain containing 1
(Homo sapiens (Human))
BDBM62340
(MLS-0425706.0001 | N-[(4S)-1-(2-fluorophenyl)-4,5,...)
Show SMILES Cn1nccc1C(=O)N[C@H]1CCCc2c1cnn2-c1ccccc1F
Show InChI InChI=1S/C18H18FN5O/c1-23-17(9-10-20-23)18(25)22-14-6-4-8-15-12(14)11-21-24(15)16-7-3-2-5-13(16)19/h2-3,5,7,9-11,14H,4,6,8H2,1H3,(H,22,25)/t14-/m0/s1
Reactome pathway
PCBioAssay
n/an/a 781n/an/an/an/an/an/a
Burnham Center for Chemical Genomics
Curated by PubChem BioAssay
Assay Description
Data Source: Sanford-Burnham Center for Chemical Genomics (SBCCG) Source Affiliation: Sanford-Burnham Medical Research Institute (SBMRI, San Diego, C...
PubChem Bioassay (2010)
BindingDB Entry DOI: 10.7270/Q2Z899VD
Tumor necrosis factor
(Homo sapiens (Human))
BDBM62340
(MLS-0425706.0001 | N-[(4S)-1-(2-fluorophenyl)-4,5,...)
Show SMILES Cn1nccc1C(=O)N[C@H]1CCCc2c1cnn2-c1ccccc1F
Show InChI InChI=1S/C18H18FN5O/c1-23-17(9-10-20-23)18(25)22-14-6-4-8-15-12(14)11-21-24(15)16-7-3-2-5-13(16)19/h2-3,5,7,9-11,14H,4,6,8H2,1H3,(H,22,25)/t14-/m0/s1
Reactome pathway
PCBioAssay
n/an/a 994n/an/an/an/an/an/a
Burnham Center for Chemical Genomics
Curated by PubChem BioAssay
Assay Description
Data Source: Sanford-Burnham Center for Chemical Genomics (SBCCG) Source Affiliation: Sanford-Burnham Medical Research Institute (SBMRI, San Diego, C...
PubChem Bioassay (2010)
BindingDB Entry DOI: 10.7270/Q2PR7TDC
nucleotide-binding oligomerization domain containing 2
(Homo sapiens (Human))
BDBM62340
(MLS-0425706.0001 | N-[(4S)-1-(2-fluorophenyl)-4,5,...)
Show SMILES Cn1nccc1C(=O)N[C@H]1CCCc2c1cnn2-c1ccccc1F
Show InChI InChI=1S/C18H18FN5O/c1-23-17(9-10-20-23)18(25)22-14-6-4-8-15-12(14)11-21-24(15)16-7-3-2-5-13(16)19/h2-3,5,7,9-11,14H,4,6,8H2,1H3,(H,22,25)/t14-/m0/s1
Reactome pathway
PCBioAssay
n/an/a 1.12E+3n/an/an/an/an/an/a
Burnham Center for Chemical Genomics
Curated by PubChem BioAssay
Assay Description
Data Source: Sanford-Burnham Center for Chemical Genomics (SBCCG) Source Affiliation: Sanford-Burnham Medical Research Institute (SBMRI, San Diego, C...
PubChem Bioassay (2010)
BindingDB Entry DOI: 10.7270/Q2TH8K43