BDBM6245 8-Ethyl-2-[4-(4-methylpiperazin-1-yl)phenylamino]-8H-pyrido[2,3-d]pyrimidin-7-one::8-ethyl-2-{[4-(4-methylpiperazin-1-yl)phenyl]amino}-7H,8H-pyrido[2,3-d]pyrimidin-7-one::C2 Pyrido[2,3-d]pyrimidin-7-one deriv. 37
SMILES: CCn1c2nc(Nc3ccc(cc3)N3CCN(C)CC3)ncc2ccc1=O
InChI Key: InChIKey=BUNLBUQVVVGGJD-UHFFFAOYSA-N
Data: 1 IC50
Activity Spreadsheet -- Enzyme Inhibition Constant Data from BindingDB
Found 1 hit for monomerid = 6245
Trg + Lig
Ki
nM
ΔG°
kcal/mole
IC50
nM
Kd
nM
EC50/IC50
nM
koff
s-1
kon
M-1s-1
pHTemp
°C
Cyclin-Dependent Kinase 4 (CDK4)
(Homo sapiens (Human))
BDBM6245
(8-Ethyl-2-[4-(4-methylpiperazin-1-yl)phenylamino]-...)
Show SMILES CCn1c2nc(Nc3ccc(cc3)N3CCN(C)CC3)ncc2ccc1=O
Show InChI InChI=1S/C20H24N6O/c1-3-26-18(27)9-4-15-14-21-20(23-19(15)26)22-16-5-7-17(8-6-16)25-12-10-24(2)11-13-25/h4-9,14H,3,10-13H2,1-2H3,(H,21,22,23)
NCI pathway
Reactome pathway
n/an/a 85n/an/an/an/an/an/a
Parke-Davis Pharmaceutical Research
Assay Description
The enzyme was assayed with substrate GST- retinoblastoma in the presence of 25 uM ATP/[gamma-32P] ATP. IC50 is the inhibitor concentration, which in...
J Med Chem 43: 4606-16 (2000)
Article DOI: 10.1021/jm000271k
BindingDB Entry DOI: 10.7270/Q25B00N4