BDBM62478 4-[(2-keto-4,10-dihydro-3H-pyrimido[1,2-a]benzimidazole-4-carbonyl)amino]benzoic acid ethyl ester::4-[[oxo-(2-oxo-4,10-dihydro-3H-pyrimido[1,2-a]benzimidazol-4-yl)methyl]amino]benzoic acid ethyl ester::MLS000719121::SMR000291389::cid_5973599::ethyl 4-[(2-oxidanylidene-4,10-dihydro-3H-pyrimido[1,2-a]benzimidazol-4-yl)carbonylamino]benzoate::ethyl 4-[(2-oxo-4,10-dihydro-3H-pyrimido[1,2-a]benzimidazole-4-carbonyl)amino]benzoate
SMILES: CCOC(=O)c1ccc(NC(=O)C2CC(=O)Nc3nc4ccccc4n23)cc1
InChI Key: InChIKey=HCIQCPISOUEFQN-UHFFFAOYSA-N
Data: 2 IC50
Activity Spreadsheet -- Enzyme Inhibition Constant Data from BindingDB
Found 2 hits for monomerid = 62478
Trg + Lig
Ki
nM
ΔG°
kcal/mole
IC50
nM
Kd
nM
EC50/IC50
nM
koff
s-1
kon
M-1s-1
pHTemp
°C
EBNA-1 protein
(Human herpesvirus 4)
BDBM62478
(4-[(2-keto-4,10-dihydro-3H-pyrimido[1,2-a]benzimid...)
Show SMILES CCOC(=O)c1ccc(NC(=O)C2CC(=O)Nc3nc4ccccc4n23)cc1
Show InChI InChI=1S/C20H18N4O4/c1-2-28-19(27)12-7-9-13(10-8-12)21-18(26)16-11-17(25)23-20-22-14-5-3-4-6-15(14)24(16)20/h3-10,16H,2,11H2,1H3,(H,21,26)(H,22,23,25)
PCBioAssay
n/an/a 5.47E+3n/an/an/an/an/an/a
The Scripps Research Institute Molecular Screening Center
Curated by PubChem BioAssay
Assay Description
Source (MLPCN Center Name): The Scripps Research Institute Molecular Screening Center (SRIMSC) Center Affiliation: The Scripps Research Institute (TS...
PubChem Bioassay (2010)
BindingDB Entry DOI: 10.7270/Q2RJ4GXC
BZLF1
(Human herpesvirus 4)
BDBM62478
(4-[(2-keto-4,10-dihydro-3H-pyrimido[1,2-a]benzimid...)
Show SMILES CCOC(=O)c1ccc(NC(=O)C2CC(=O)Nc3nc4ccccc4n23)cc1
Show InChI InChI=1S/C20H18N4O4/c1-2-28-19(27)12-7-9-13(10-8-12)21-18(26)16-11-17(25)23-20-22-14-5-3-4-6-15(14)24(16)20/h3-10,16H,2,11H2,1H3,(H,21,26)(H,22,23,25)
PCBioAssay
n/an/a 1.11E+5n/an/an/an/an/an/a
The Scripps Research Institute Molecular Screening Center
Curated by PubChem BioAssay
Assay Description
Source (MLPCN Center Name): The Scripps Research Institute Molecular Screening Center (SRIMSC) Center Affiliation: The Scripps Research Institute (TS...
PubChem Bioassay (2010)
BindingDB Entry DOI: 10.7270/Q2W957MN