BDBM62488 1-(4-methoxyphenyl)-3-[[3-(trifluoromethyl)phenyl]carbamothioylamino]thiourea::1-(4-methoxyphenyl)-3-[[3-(trifluoromethyl)phenyl]thiocarbamoylamino]thiourea::1-[[(4-methoxyanilino)-sulfanylidenemethyl]amino]-3-[3-(trifluoromethyl)phenyl]thiourea::MLS001012152::SMR000425319::cid_1930028
SMILES: COc1ccc(NC(=S)NNC(=S)Nc2cccc(c2)C(F)(F)F)cc1
InChI Key: InChIKey=MUDUZCVVCWNZMP-UHFFFAOYSA-N
Data: 2 IC50
Activity Spreadsheet -- Enzyme Inhibition Constant Data from BindingDB
Found 2 hits for monomerid = 62488
Trg + Lig
Ki
nM
ΔG°
kcal/mole
IC50
nM
Kd
nM
EC50/IC50
nM
koff
s-1
kon
M-1s-1
pHTemp
°C
EBNA-1 protein
(Human herpesvirus 4)
BDBM62488
(1-(4-methoxyphenyl)-3-[[3-(trifluoromethyl)phenyl]...)
Show SMILES COc1ccc(NC(=S)NNC(=S)Nc2cccc(c2)C(F)(F)F)cc1
Show InChI InChI=1S/C16H15F3N4OS2/c1-24-13-7-5-11(6-8-13)20-14(25)22-23-15(26)21-12-4-2-3-10(9-12)16(17,18)19/h2-9H,1H3,(H2,20,22,25)(H2,21,23,26)
PCBioAssay
n/an/a 6.70E+3n/an/an/an/an/an/a
The Scripps Research Institute Molecular Screening Center
Curated by PubChem BioAssay
Assay Description
Source (MLPCN Center Name): The Scripps Research Institute Molecular Screening Center (SRIMSC) Center Affiliation: The Scripps Research Institute (TS...
PubChem Bioassay (2010)
BindingDB Entry DOI: 10.7270/Q2RJ4GXC
BZLF1
(Human herpesvirus 4)
BDBM62488
(1-(4-methoxyphenyl)-3-[[3-(trifluoromethyl)phenyl]...)
Show SMILES COc1ccc(NC(=S)NNC(=S)Nc2cccc(c2)C(F)(F)F)cc1
Show InChI InChI=1S/C16H15F3N4OS2/c1-24-13-7-5-11(6-8-13)20-14(25)22-23-15(26)21-12-4-2-3-10(9-12)16(17,18)19/h2-9H,1H3,(H2,20,22,25)(H2,21,23,26)
PCBioAssay
n/an/a 1.11E+5n/an/an/an/an/an/a
The Scripps Research Institute Molecular Screening Center
Curated by PubChem BioAssay
Assay Description
Source (MLPCN Center Name): The Scripps Research Institute Molecular Screening Center (SRIMSC) Center Affiliation: The Scripps Research Institute (TS...
PubChem Bioassay (2010)
BindingDB Entry DOI: 10.7270/Q2W957MN