BDBM62496 3,4-dimethyl-N-(6-methylsulfonyl-1,3-benzothiazol-2-yl)benzamide::MLS001204974::N-(6-Methanesulfonyl-benzothiazol-2-yl)-3,4-dimethyl-benzamide::N-(6-mesyl-1,3-benzothiazol-2-yl)-3,4-dimethyl-benzamide::SMR000517361::cid_1073734
SMILES: Cc1ccc(cc1C)C(=O)Nc1nc2ccc(cc2s1)S(C)(=O)=O
InChI Key: InChIKey=WQBIMXGXVSPHNZ-UHFFFAOYSA-N
Data: 2 IC50
Activity Spreadsheet -- Enzyme Inhibition Constant Data from BindingDB
Found 2 hits for monomerid = 62496
Trg + Lig
Ki
nM
ΔG°
kcal/mole
IC50
nM
Kd
nM
EC50/IC50
nM
koff
s-1
kon
M-1s-1
pHTemp
°C
EBNA-1 protein
(Human herpesvirus 4)
BDBM62496
(3,4-dimethyl-N-(6-methylsulfonyl-1,3-benzothiazol-...)
Show SMILES Cc1ccc(cc1C)C(=O)Nc1nc2ccc(cc2s1)S(C)(=O)=O
Show InChI InChI=1S/C17H16N2O3S2/c1-10-4-5-12(8-11(10)2)16(20)19-17-18-14-7-6-13(24(3,21)22)9-15(14)23-17/h4-9H,1-3H3,(H,18,19,20)
PCBioAssay
n/an/a 4.48E+3n/an/an/an/an/an/a
The Scripps Research Institute Molecular Screening Center
Curated by PubChem BioAssay
Assay Description
Source (MLPCN Center Name): The Scripps Research Institute Molecular Screening Center (SRIMSC) Center Affiliation: The Scripps Research Institute (TS...
PubChem Bioassay (2010)
BindingDB Entry DOI: 10.7270/Q2RJ4GXC
BZLF1
(Human herpesvirus 4)
BDBM62496
(3,4-dimethyl-N-(6-methylsulfonyl-1,3-benzothiazol-...)
Show SMILES Cc1ccc(cc1C)C(=O)Nc1nc2ccc(cc2s1)S(C)(=O)=O
Show InChI InChI=1S/C17H16N2O3S2/c1-10-4-5-12(8-11(10)2)16(20)19-17-18-14-7-6-13(24(3,21)22)9-15(14)23-17/h4-9H,1-3H3,(H,18,19,20)
PCBioAssay
n/an/a 1.11E+5n/an/an/an/an/an/a
The Scripps Research Institute Molecular Screening Center
Curated by PubChem BioAssay
Assay Description
Source (MLPCN Center Name): The Scripps Research Institute Molecular Screening Center (SRIMSC) Center Affiliation: The Scripps Research Institute (TS...
PubChem Bioassay (2010)
BindingDB Entry DOI: 10.7270/Q2W957MN