BDBM6252 8-(3-methylbutyl)-2-(phenylamino)-7H,8H-pyrido[2,3-d]pyrimidin-7-one::N8 Pyrido[2,3-d]pyrimidin-7-one deriv. 44
SMILES: CC(C)CCn1c2nc(Nc3ccccc3)ncc2ccc1=O
InChI Key: InChIKey=LAZXKXIOSQUFFZ-UHFFFAOYSA-N
Data: 1 IC50
Activity Spreadsheet -- Enzyme Inhibition Constant Data from BindingDB
Found 1 hit for monomerid = 6252
Trg + Lig
Ki
nM
ΔG°
kcal/mole
IC50
nM
Kd
nM
EC50/IC50
nM
koff
s-1
kon
M-1s-1
pHTemp
°C
Cyclin-Dependent Kinase 4 (CDK4)
(Homo sapiens (Human))
BDBM6252
(8-(3-methylbutyl)-2-(phenylamino)-7H,8H-pyrido[2,3...)
Show SMILES CC(C)CCn1c2nc(Nc3ccccc3)ncc2ccc1=O
Show InChI InChI=1S/C18H20N4O/c1-13(2)10-11-22-16(23)9-8-14-12-19-18(21-17(14)22)20-15-6-4-3-5-7-15/h3-9,12-13H,10-11H2,1-2H3,(H,19,20,21)
NCI pathway
Reactome pathway
n/an/a 159n/an/an/an/an/an/a
Parke-Davis Pharmaceutical Research
Assay Description
The enzyme was assayed with substrate GST- retinoblastoma in the presence of 25 uM ATP/[gamma-32P] ATP. IC50 is the inhibitor concentration, which in...
J Med Chem 43: 4606-16 (2000)
Article DOI: 10.1021/jm000271k
BindingDB Entry DOI: 10.7270/Q25B00N4